program: Orca
programVersion: 5.0.2
elementType: S P O O O N N N C C C C C C C C C C C C H H H H H H H H H H H H H H H H
charge: 0
multiplicity: 1
keywords: wb97x-d3
keywords: def2-TZVPP
keywords: def2/J RIJCOSX
keywords: DEFGRID2
keywords: scfconv7
keywords: smallprint printgap noloewdin
keywords: NOSOSCF
formula: C12H16N3O3PS
InChI: InChI=1/C12H16N3O3PS/c1-3-16-19(20,17-4-2)18-12-13-10-15(14-12)11-8-6-5-7-9-11/h5-10H,3-4H2,1-2H3
36 atoms
S  3.978867 -0.158824 -0.782213
P  2.314114 -0.08355 0.156018
O  1.157296 -0.854718 -0.70933
O  2.218123 -0.73415 1.601196
O  1.683232 1.333478 0.490758
N  -2.122666 -0.50641 -0.106985
N  -0.993429 -0.015646 -0.630802
N  -0.599152 -1.983886 0.372267
C  -3.350438 0.183133 -0.230054
C  -0.130256 -0.932791 -0.307238
C  3.108464 -1.783327 2.046381
C  1.964982 2.525575 -0.276586
C  -1.867749 -1.68011 0.482713
C  -4.421094 -0.157116 0.587785
C  -3.472118 1.199692 -1.168575
C  -5.624193 0.516571 0.446652
C  -4.678346 1.872718 -1.28873
C  2.903281 -3.088564 1.32023
C  1.371567 2.498998 -1.662875
C  -5.759655 1.533166 -0.488527
H  4.138274 -1.436248 1.948705
H  2.887932 -1.889859 3.106398
H  1.535783 3.332477 0.313711
H  3.045344 2.67366 -0.314375
H  -2.619213 -2.2879 0.959387
H  -4.330416 -0.927572 1.341622
H  -2.63853 1.466543 -1.802432
H  1.876001 -3.439448 1.40242
H  3.170041 -3.020277 0.265406
H  3.550194 -3.84052 1.772582
H  0.292931 2.352637 -1.640142
H  1.568763 3.459149 -2.140254
H  1.818793 1.725714 -2.28811
H  -6.456223 0.24767 1.083355
H  -4.769521 2.665661 -2.018909
H  -6.699466 2.058977 -0.589024
elementType: S P O N C H
totalener: -1596.59116966 hartree
nucrepener: 1911.07831150 hartree
electener: -3507.66948116 hartree
oneelecener: -5990.33533547 hartree
twoeener: 2482.66585431 hartree
cpcmener: -0.03054160 hartree
kineticenergy: 1591.56143213 hartree
xcener: -117.728819062386 hartree
chargesum: -0.0000000
charge: -0.422363 0.719089 -0.323013 -0.347826 -0.344762 0.158821 -0.346133 -0.398105 0.163960 0.345364 0.033832 0.030543 0.114311 -0.204197 -0.197605 -0.135228 -0.132206 -0.245938 -0.248402 -0.173144 0.099366 0.114349 0.114399 0.100018 0.176255 0.148971 0.157274 0.083639 0.084143 0.105001 0.087835 0.106538 0.085381 0.163691 0.162683 0.163459
qa: -0.4224 0.7191 -0.3230 -0.3478 -0.3448 0.1588 -0.3461 -0.3981 0.1640 0.3454 0.0338 0.0305 0.1143 -0.2042 -0.1976 -0.1352 -0.1322 -0.2459 -0.2484 -0.1731 0.0994 0.1143 0.1144 0.1000 0.1763 0.1490 0.1573 0.0836 0.0841 0.1050 0.0878 0.1065 0.0854 0.1637 0.1627 0.1635
va: 2.0156 5.4851 2.0888 2.0944 2.0967 3.3972 2.8401 3.0316 3.7416 4.2026 3.8455 3.8470 4.0278 3.9736 3.9461 3.9012 3.9122 3.8774 3.8844 3.9124 1.0083 0.9918 0.9915 1.0084 0.9887 1.0050 1.0150 1.0228 1.0203 1.0094 1.0124 1.0095 1.0198 0.9891 0.9896 0.9879
dispcorr: -0.016295663 hartree
energy: -1596.607465318570
dipole: -4.84649 2.27052 -2.57597 3.52371 -3.01367 0.51005 1.59049 -0.57545 1.01504
magnitude: 2.81533 au
magnitude: 7.15599 debye
