program: Orca
programVersion: 5.0.2
elementType: S P O O O N N N C C C C C C C C C C C C H H H H H H H H H H H H H H H H
charge: 0
multiplicity: 1
keywords: wb97x-d3
keywords: def2-TZVPP
keywords: def2/J RIJCOSX
keywords: DEFGRID2
keywords: scfconv7
keywords: smallprint printgap noloewdin
keywords: NOSOSCF
formula: C12H16N3O3PS
InChI: InChI=1/C12H16N3O3PS/c1-3-16-19(20,17-4-2)18-12-13-10-15(14-12)11-8-6-5-7-9-11/h5-10H,3-4H2,1-2H3
36 atoms
S  1.244233 -2.765375 0.690487
P  1.966825 -1.000711 0.574665
O  1.197675 0.16093 1.433693
O  3.404159 -0.875988 1.225272
O  2.059564 -0.325681 -0.861071
N  -1.918384 0.843654 0.40057
N  -0.766878 0.191287 0.179124
N  -0.64634 1.386346 2.081009
C  -3.019505 0.726339 -0.475308
C  -0.064232 0.559685 1.210201
C  4.144335 0.366729 1.335541
C  1.70669 -0.995765 -2.091548
C  -1.826017 1.541005 1.534215
C  -3.902466 1.789834 -0.6104
C  -3.208001 -0.450968 -1.186506
C  -4.997752 1.659367 -1.450103
C  -4.299896 -0.561313 -2.033647
C  5.578703 0.024386 1.637129
C  1.421013 0.05174 -3.134135
C  -5.199195 0.487808 -2.16598
H  4.068037 0.930402 0.404729
H  3.707271 0.962462 2.137329
H  2.538883 -1.634816 -2.38875
H  0.834587 -1.628802 -1.926686
H  -2.635565 2.130037 1.934486
H  -3.736606 2.718801 -0.080475
H  -2.51817 -1.276339 -1.076726
H  6.036591 -0.539303 0.824711
H  6.142953 0.948186 1.76406
H  5.66853 -0.550133 2.558925
H  1.174332 -0.445117 -4.072379
H  0.571913 0.674606 -2.852041
H  2.283637 0.693183 -3.313762
H  -5.687069 2.48654 -1.553177
H  -4.449041 -1.478159 -2.587879
H  -6.051245 0.393614 -2.825599
elementType: S P O N C H
totalener: -1596.59532205 hartree
nucrepener: 1898.56068342 hartree
electener: -3495.15600547 hartree
oneelecener: -5965.00909493 hartree
twoeener: 2469.85308946 hartree
cpcmener: -0.03276865 hartree
kineticenergy: 1591.56617580 hartree
xcener: -117.727428494664 hartree
chargesum: -0.0000000
charge: -0.427488 0.721730 -0.314252 -0.343486 -0.337810 0.134993 -0.364928 -0.391059 0.159129 0.362630 0.035111 0.043566 0.101112 -0.202584 -0.201758 -0.130615 -0.123070 -0.243229 -0.242300 -0.169504 0.110117 0.103488 0.120991 0.097521 0.181917 0.153582 0.144724 0.088664 0.088888 0.088663 0.091756 0.081785 0.092107 0.163638 0.162790 0.163181
qa: -0.4275 0.7217 -0.3143 -0.3435 -0.3378 0.1350 -0.3649 -0.3911 0.1591 0.3626 0.0351 0.0436 0.1011 -0.2026 -0.2018 -0.1306 -0.1231 -0.2432 -0.2423 -0.1695 0.1101 0.1035 0.1210 0.0975 0.1819 0.1536 0.1447 0.0887 0.0889 0.0887 0.0918 0.0818 0.0921 0.1636 0.1628 0.1632
va: 2.0112 5.5157 2.1280 2.1387 2.0619 3.4382 2.8364 3.0411 3.6757 4.2146 3.8451 3.8018 4.0402 3.9795 3.9740 3.8998 3.9040 3.9616 3.9626 3.9103 0.9935 0.9937 0.9957 1.0045 0.9868 1.0023 1.0232 1.0050 1.0061 1.0038 1.0068 1.0081 1.0029 0.9892 0.9892 0.9884
dispcorr: -0.015380772 hartree
energy: -1596.610702821702
dipole: 5.53726 -6.64017 -1.10292 6.69055 -4.64483 2.04573 -12.89939 11.06032 -1.83906
magnitude: 2.96371 au
magnitude: 7.53315 debye
