program: Orca
programVersion: 5.0.2
elementType: S P O O O N N N C C C C C C C C C C C C H H H H H H H H H H H H H H H H
charge: 0
multiplicity: 1
keywords: wb97x-d3
keywords: def2-TZVPP
keywords: def2/J RIJCOSX
keywords: DEFGRID2
keywords: scfconv7
keywords: smallprint printgap noloewdin
keywords: NOSOSCF
formula: C12H16N3O3PS
InChI: InChI=1/C12H16N3O3PS/c1-3-16-19(20,17-4-2)18-12-13-10-15(14-12)11-8-6-5-7-9-11/h5-10H,3-4H2,1-2H3
36 atoms
S  1.467672 -2.419012 0.454084
P  2.054649 -0.596439 0.435977
O  1.196487 0.429476 1.381054
O  3.498917 -0.281826 1.009674
O  2.079832 0.190789 -0.937631
N  -1.979886 0.86549 0.395536
N  -0.779687 0.316944 0.153239
N  -0.743248 1.473146 2.081268
C  -3.06605 0.670018 -0.485132
C  -0.101259 0.719076 1.187116
C  4.05567 -0.967847 2.155009
C  1.943395 -0.408934 -2.245164
C  -1.936767 1.541864 1.545303
C  -3.102445 -0.469357 -1.278246
C  -4.079758 1.617171 -0.552563
C  -4.172959 -0.660956 -2.138304
C  -5.150871 1.404049 -1.406484
C  5.202371 -1.840249 1.717897
C  1.093562 0.486944 -3.106539
C  -5.201514 0.268605 -2.203093
H  4.384236 -0.189659 2.842585
H  3.287865 -1.556739 2.659733
H  2.945305 -0.524662 -2.658315
H  1.496878 -1.399716 -2.151651
H  -2.78822 2.053585 1.964398
H  -2.310293 -1.203187 -1.224429
H  -4.036543 2.52159 0.040089
H  5.65016 -2.31004 2.593752
H  4.866043 -2.630178 1.046512
H  5.977215 -1.259915 1.2168
H  0.077229 0.567671 -2.722003
H  1.517956 1.487226 -3.192404
H  1.039958 0.062111 -4.108934
H  -4.201711 -1.547994 -2.756672
H  -5.940816 2.141245 -1.457201
H  -6.035055 0.111332 -2.874171
elementType: S P O N C H
totalener: -1596.59376923 hartree
nucrepener: 1903.12366701 hartree
electener: -3499.71743625 hartree
oneelecener: -5974.41615584 hartree
twoeener: 2474.69871959 hartree
cpcmener: -0.03064227 hartree
kineticenergy: 1591.56928838 hartree
xcener: -117.730382510834 hartree
chargesum: 0.0000000
charge: -0.442064 0.767947 -0.318548 -0.350102 -0.343404 0.141730 -0.367119 -0.388758 0.170305 0.355099 0.044534 0.042978 0.100707 -0.216601 -0.204355 -0.115668 -0.131636 -0.229034 -0.235054 -0.172668 0.107858 0.086314 0.115542 0.095292 0.180592 0.142132 0.152319 0.094611 0.075205 0.090531 0.075940 0.091936 0.094109 0.162814 0.162965 0.163551
qa: -0.4421 0.7679 -0.3185 -0.3501 -0.3434 0.1417 -0.3671 -0.3888 0.1703 0.3551 0.0445 0.0430 0.1007 -0.2166 -0.2044 -0.1157 -0.1316 -0.2290 -0.2351 -0.1727 0.1079 0.0863 0.1155 0.0953 0.1806 0.1421 0.1523 0.0946 0.0752 0.0905 0.0759 0.0919 0.0941 0.1628 0.1630 0.1636
va: 1.9827 5.4871 2.1488 2.1169 2.1038 3.4298 2.8263 3.0430 3.6721 4.2217 3.8464 3.8203 4.0415 3.9609 3.9825 3.8946 3.9000 3.9344 3.9472 3.9128 0.9970 1.0116 0.9932 1.0123 0.9881 1.0275 1.0030 1.0079 1.0155 1.0041 1.0070 1.0046 1.0083 0.9889 0.9894 0.9880
dispcorr: -0.015587205 hartree
energy: -1596.609356438565
dipole: 3.69187 -4.93338 -1.24151 -1.52804 2.08816 0.56012 -10.27808 9.16553 -1.11255
magnitude: 1.75865 au
magnitude: 4.47014 debye
