program: Orca
programVersion: 5.0.2
elementType: S P O O O N N N C C C C C C C C C C C C H H H H H H H H H H H H H H H H
charge: 0
multiplicity: 1
keywords: wb97x-d3
keywords: def2-TZVPP
keywords: def2/J RIJCOSX
keywords: DEFGRID2
keywords: scfconv7
keywords: smallprint printgap noloewdin
keywords: NOSOSCF
formula: C12H16N3O3PS
InChI: InChI=1/C12H16N3O3PS/c1-3-16-19(20,17-4-2)18-12-13-10-15(14-12)11-8-6-5-7-9-11/h5-10H,3-4H2,1-2H3
36 atoms
S  1.388261 -2.094824 1.235589
P  1.958866 -0.341278 0.7223
O  1.111042 0.916051 1.339689
O  3.347861 0.18036 1.281846
O  2.021184 -0.016962 -0.833132
N  -2.065179 1.050054 0.268691
N  -0.855212 0.477713 0.173078
N  -0.839116 2.089012 1.739544
C  -3.136177 0.635991 -0.554511
C  -0.185756 1.138667 1.069456
C  4.472628 -0.692775 1.523441
C  1.396019 -0.820998 -1.8617
C  -2.030045 2.005817 1.200125
C  -2.865194 -0.078675 -1.714068
C  -4.44487 0.939282 -0.198645
C  -3.916385 -0.487027 -2.52112
C  -5.483446 0.536757 -1.023708
C  5.216463 -1.02888 0.256295
C  2.396414 -1.754686 -2.491147
C  -5.226577 -0.179023 -2.184771
H  5.105968 -0.139691 2.214175
H  4.1276 -1.594745 2.032127
H  0.552306 -1.371227 -1.446571
H  1.007583 -0.106635 -2.585926
H  -2.874712 2.626536 1.450263
H  -1.847435 -0.314993 -1.991492
H  -4.668731 1.471887 0.715898
H  6.114514 -1.590107 0.515891
H  4.624514 -1.649585 -0.416703
H  5.526418 -0.130186 -0.276595
H  2.751781 -2.49956 -1.779137
H  1.916593 -2.282796 -3.315818
H  3.253574 -1.215231 -2.893797
H  -3.702683 -1.046884 -3.421727
H  -6.500824 0.775393 -0.744433
H  -6.042068 -0.498264 -2.819507
elementType: S P O N C H
totalener: -1596.59376992 hartree
nucrepener: 1910.89089158 hartree
electener: -3507.48466150 hartree
oneelecener: -5989.62079818 hartree
twoeener: 2482.13613668 hartree
cpcmener: -0.03249246 hartree
kineticenergy: 1591.57108559 hartree
xcener: -117.733148189038 hartree
chargesum: 0.0000000
charge: -0.437889 0.750880 -0.321245 -0.344890 -0.346719 0.127876 -0.359496 -0.388073 0.149418 0.353380 0.037010 0.076296 0.105659 -0.183694 -0.193112 -0.149236 -0.140043 -0.249158 -0.262594 -0.165748 0.111012 0.093529 0.086974 0.110634 0.178204 0.163087 0.149157 0.102053 0.085984 0.092936 0.079011 0.105764 0.095459 0.161118 0.162770 0.163685
qa: -0.4379 0.7509 -0.3212 -0.3449 -0.3467 0.1279 -0.3595 -0.3881 0.1494 0.3534 0.0370 0.0763 0.1057 -0.1837 -0.1931 -0.1492 -0.1400 -0.2492 -0.2626 -0.1657 0.1110 0.0935 0.0870 0.1106 0.1782 0.1631 0.1492 0.1021 0.0860 0.0929 0.0790 0.1058 0.0955 0.1611 0.1628 0.1637
va: 1.9870 5.4999 2.1578 2.1187 2.0739 3.4587 2.8257 3.0462 3.7538 4.2216 3.8488 3.7880 4.0442 3.9461 3.9672 3.9367 3.9036 3.9067 3.9471 3.9021 0.9920 1.0126 1.0138 0.9928 0.9895 1.0043 1.0042 1.0091 1.0021 1.0060 1.0087 1.0102 1.0016 0.9910 0.9894 0.9878
dispcorr: -0.016468540 hartree
energy: -1596.610238456382
dipole: 7.06128 -8.17812 -1.11684 -7.81149 7.74192 -0.06957 -14.68174 12.73503 -1.94672
magnitude: 2.24541 au
magnitude: 5.70738 debye
