program: Orca
programVersion: 5.0.2
elementType: S P O O O N N N C C C C C C C C C C C C H H H H H H H H H H H H H H H H
charge: 0
multiplicity: 1
keywords: wb97x-d3
keywords: def2-TZVPP
keywords: def2/J RIJCOSX
keywords: DEFGRID2
keywords: scfconv7
keywords: smallprint printgap noloewdin
keywords: NOSOSCF
formula: C12H16N3O3PS
InChI: InChI=1/C12H16N3O3PS/c1-3-16-19(20,17-4-2)18-12-13-10-15(14-12)11-8-6-5-7-9-11/h5-10H,3-4H2,1-2H3
36 atoms
S  1.989901 -0.773537 -1.919568
P  2.205988 -0.184763 -0.111639
O  1.426513 1.200504 0.285103
O  1.745927 -1.136168 1.06624
O  3.664802 0.230746 0.354923
N  -1.912648 0.936547 0.111656
N  -0.720078 0.324226 0.082631
N  -0.45958 2.540169 0.353664
C  -3.111011 0.204382 -0.03419
C  0.089955 1.330063 0.231957
C  1.430233 -2.539119 0.932942
C  4.662367 0.749416 -0.552752
C  -1.734702 2.250033 0.270637
C  -3.088973 -1.004881 -0.717408
C  -4.29144 0.692102 0.511032
C  -4.264841 -1.725661 -0.857074
C  -5.462541 -0.032325 0.348888
C  0.290221 -2.866546 1.861801
C  4.366971 2.159273 -0.998569
C  -5.454715 -1.242608 -0.330563
H  1.168043 -2.761378 -0.102351
H  2.325921 -3.106942 1.186632
H  5.592205 0.705264 0.010573
H  4.753476 0.076355 -1.406963
H  -2.545559 2.959926 0.304932
H  -2.167747 -1.379026 -1.141716
H  -4.305668 1.617318 1.071818
H  -0.619487 -2.335806 1.581026
H  0.086533 -3.935799 1.80686
H  0.531496 -2.627001 2.897399
H  4.241394 2.831957 -0.150483
H  5.208274 2.521001 -1.590421
H  3.477365 2.214501 -1.626737
H  -4.247503 -2.667944 -1.388052
H  -6.382002 0.348096 0.772901
H  -6.369958 -1.807541 -0.445395
elementType: S P O N C H
totalener: -1596.59398442 hartree
nucrepener: 1915.95537462 hartree
electener: -3512.54935904 hartree
oneelecener: -6000.16119510 hartree
twoeener: 2487.61183606 hartree
cpcmener: -0.03044637 hartree
kineticenergy: 1591.57762278 hartree
xcener: -117.732658147544 hartree
chargesum: -0.0000000
charge: -0.440610 0.767789 -0.319752 -0.345750 -0.350876 0.140579 -0.365221 -0.389611 0.171565 0.360370 0.037853 0.029793 0.101531 -0.215812 -0.203085 -0.116917 -0.131166 -0.235605 -0.235558 -0.172618 0.096737 0.115874 0.110892 0.096476 0.180165 0.141366 0.151655 0.076573 0.093694 0.091361 0.091269 0.100282 0.078140 0.162918 0.162431 0.163268
qa: -0.4406 0.7678 -0.3198 -0.3458 -0.3509 0.1406 -0.3652 -0.3896 0.1716 0.3604 0.0379 0.0298 0.1015 -0.2158 -0.2031 -0.1169 -0.1312 -0.2356 -0.2356 -0.1726 0.0967 0.1159 0.1109 0.0965 0.1802 0.1414 0.1517 0.0766 0.0937 0.0914 0.0913 0.1003 0.0781 0.1629 0.1624 0.1633
va: 1.9874 5.4815 2.1383 2.1096 2.1195 3.4312 2.8319 3.0433 3.6747 4.2120 3.8270 3.8577 4.0407 3.9580 3.9808 3.8949 3.8996 3.9497 3.8854 3.9115 1.0098 0.9935 0.9920 1.0094 0.9878 1.0272 1.0033 1.0070 1.0080 1.0046 1.0064 1.0085 1.0186 0.9889 0.9896 0.9882
dispcorr: -0.015932812 hartree
energy: -1596.609917231650
dipole: -1.24161 -0.29756 -1.53917 -6.48583 5.83698 -0.64885 2.76685 -2.28811 0.47874
magnitude: 1.73759 au
magnitude: 4.41661 debye
