program: Orca
programVersion: 5.0.2
elementType: S P O O O N N N C C C C C C C C C C C C H H H H H H H H H H H H H H H H
charge: 0
multiplicity: 1
keywords: wb97x-d3
keywords: def2-TZVPP
keywords: def2/J RIJCOSX
keywords: DEFGRID2
keywords: scfconv7
keywords: smallprint printgap noloewdin
keywords: NOSOSCF
formula: C12H16N3O3PS
InChI: InChI=1/C12H16N3O3PS/c1-3-16-19(20,17-4-2)18-12-13-10-15(14-12)11-8-6-5-7-9-11/h5-10H,3-4H2,1-2H3
36 atoms
S  1.505981 -2.502395 -0.19611
P  2.080848 -0.732151 0.23937
O  1.214837 0.053909 1.388342
O  3.50449 -0.698158 0.926756
O  2.120516 0.353564 -0.921497
N  -1.977597 0.621343 0.52974
N  -0.753518 0.221457 0.154432
N  -0.762772 0.792825 2.328611
C  -3.068043 0.59511 -0.367321
C  -0.090018 0.346722 1.265742
C  4.156143 0.506939 1.406032
C  1.799581 0.068826 -2.300744
C  -1.960392 0.952483 1.822833
C  -3.050273 -0.291956 -1.435659
C  -4.14757 1.445888 -0.167714
C  -4.129534 -0.327551 -2.304752
C  -5.227114 1.386572 -1.035536
C  4.183549 0.521106 2.912375
C  2.998368 -0.451333 -3.050666
C  -5.223152 0.503215 -2.105884
H  5.163898 0.475118 0.995441
H  3.667502 1.398633 1.011734
H  0.969385 -0.636678 -2.345963
H  1.457572 1.017368 -2.710362
H  -2.832161 1.28616 2.362226
H  -2.209006 -0.954095 -1.585441
H  -4.151179 2.159775 0.645493
H  4.67164 -0.367757 3.311651
H  4.750777 1.390176 3.246088
H  3.183257 0.592786 3.338079
H  2.727806 -0.592556 -4.097481
H  3.83185 0.249609 -3.011288
H  3.33053 -1.413636 -2.660552
H  -4.115507 -1.018504 -3.136889
H  -6.06911 2.046775 -0.87743
H  -6.065146 0.466281 -2.783797
elementType: S P O N C H
totalener: -1596.59415180 hartree
nucrepener: 1906.39073920 hartree
electener: -3502.98489099 hartree
oneelecener: -5980.75480142 hartree
twoeener: 2477.76991042 hartree
cpcmener: -0.03213146 hartree
kineticenergy: 1591.56453187 hartree
xcener: -117.728987965610 hartree
chargesum: 0.0000000
charge: -0.425919 0.728484 -0.312531 -0.349985 -0.341980 0.133288 -0.364019 -0.394265 0.159521 0.360388 0.044679 0.056282 0.105993 -0.190284 -0.201875 -0.133252 -0.132129 -0.246094 -0.235721 -0.168896 0.108185 0.101991 0.088065 0.113117 0.180271 0.143983 0.152197 0.088777 0.095295 0.084016 0.096686 0.091091 0.075717 0.162556 0.163010 0.163357
qa: -0.4259 0.7285 -0.3125 -0.3500 -0.3420 0.1333 -0.3640 -0.3943 0.1595 0.3604 0.0447 0.0563 0.1060 -0.1903 -0.2019 -0.1333 -0.1321 -0.2461 -0.2357 -0.1689 0.1082 0.1020 0.0881 0.1131 0.1803 0.1440 0.1522 0.0888 0.0953 0.0840 0.0967 0.0911 0.0757 0.1626 0.1630 0.1634
va: 2.0080 5.4961 2.1364 2.1162 2.0603 3.4326 2.8362 3.0366 3.6985 4.2099 3.8409 3.8288 4.0373 3.9616 3.9768 3.9154 3.9008 3.9360 3.9384 3.9073 0.9956 1.0013 1.0084 0.9916 0.9867 1.0236 1.0027 1.0036 1.0074 1.0122 1.0083 1.0052 1.0178 0.9894 0.9893 0.9881
dispcorr: -0.015786815 hartree
energy: -1596.609938611750
dipole: 5.23888 -6.51048 -1.27160 7.14765 -4.92499 2.22266 -7.63418 6.51611 -1.11806
magnitude: 2.79414 au
magnitude: 7.10215 debye
