program: Orca
programVersion: 5.0.2
elementType: S P O O O N N N C C C C C C C C C C C C H H H H H H H H H H H H H H H H
charge: 0
multiplicity: 1
keywords: wb97x-d3
keywords: def2-TZVPP
keywords: def2/J RIJCOSX
keywords: DEFGRID2
keywords: scfconv7
keywords: smallprint printgap noloewdin
keywords: NOSOSCF
formula: C12H16N3O3PS
InChI: InChI=1/C12H16N3O3PS/c1-3-16-19(20,17-4-2)18-12-13-10-15(14-12)11-8-6-5-7-9-11/h5-10H,3-4H2,1-2H3
36 atoms
S  2.691181 -0.379582 -2.11055
P  2.566219 -0.190919 -0.214396
O  1.136185 0.391303 0.352787
O  2.816625 -1.529443 0.586513
O  3.538801 0.844728 0.494309
N  -2.088971 -0.311897 -0.169559
N  -1.135343 0.562432 0.19217
N  -0.220616 -1.400385 -0.388261
C  -3.454661 0.046288 -0.135476
C  -0.052889 -0.144168 0.04348
C  2.77781 -1.650071 2.030977
C  4.014176 2.056557 -0.125002
C  -1.522095 -1.475075 -0.514254
C  -4.423129 -0.844829 -0.585119
C  -3.821047 1.294741 0.351972
C  -5.759015 -0.480789 -0.537312
C  -5.162169 1.645606 0.388715
C  1.646632 -2.552317 2.451341
C  2.9806 3.154243 -0.114442
C  -6.136998 0.763121 -0.051977
H  3.740883 -2.071289 2.317423
H  2.691185 -0.672549 2.507498
H  4.888024 2.338764 0.460022
H  4.346639 1.835636 -1.14115
H  -2.071946 -2.343077 -0.839355
H  -4.159651 -1.817788 -0.976839
H  -3.070331 1.989376 0.700622
H  1.717437 -2.724636 3.52607
H  0.672166 -2.109542 2.249995
H  1.699467 -3.521797 1.955511
H  2.13235 2.930397 -0.762078
H  2.610774 3.348604 0.892544
H  3.441776 4.071278 -0.483256
H  -6.507487 -1.179427 -0.887196
H  -5.441373 2.619413 0.76914
H  -7.182034 1.04119 -0.018702
elementType: S P O N C H
totalener: -1596.60193418 hartree
nucrepener: 1886.42588859 hartree
electener: -3483.02782277 hartree
oneelecener: -5940.81887632 hartree
twoeener: 2457.79105355 hartree
cpcmener: -0.02976364 hartree
kineticenergy: 1591.52037789 hartree
xcener: -117.722989547922 hartree
chargesum: 0.0000000
charge: -0.418206 0.722118 -0.316820 -0.337253 -0.331365 0.154517 -0.328601 -0.406038 0.162603 0.357410 0.039219 0.028264 0.101457 -0.206009 -0.187458 -0.139222 -0.133481 -0.250772 -0.231411 -0.171233 0.105656 0.098019 0.107172 0.092712 0.171637 0.144108 0.153179 0.097940 0.083624 0.092670 0.079670 0.089729 0.097312 0.159632 0.159280 0.159942
qa: -0.4182 0.7221 -0.3168 -0.3373 -0.3314 0.1545 -0.3286 -0.4060 0.1626 0.3574 0.0392 0.0283 0.1015 -0.2060 -0.1875 -0.1392 -0.1335 -0.2508 -0.2314 -0.1712 0.1057 0.0980 0.1072 0.0927 0.1716 0.1441 0.1532 0.0979 0.0836 0.0927 0.0797 0.0897 0.0973 0.1596 0.1593 0.1599
va: 2.0288 5.5116 2.0940 2.1193 2.1044 3.4070 2.8590 2.9978 3.7802 4.1833 3.8595 3.8707 4.0531 3.9721 3.9251 3.9121 3.9220 3.9371 3.8918 3.9180 0.9950 1.0001 0.9908 1.0115 0.9916 1.0079 1.0326 1.0094 1.0058 1.0042 1.0159 1.0059 1.0095 0.9909 0.9912 0.9890
dispcorr: -0.015641088 hartree
energy: -1596.617575270926
dipole: -3.17932 1.56902 -1.61030 4.27697 -4.07036 0.20661 10.25343 -8.63767 1.61577
magnitude: 2.29052 au
magnitude: 5.82203 debye
