program: Orca
programVersion: 5.0.2
elementType: S P O O O N N N C C C C C C C C C C C C H H H H H H H H H H H H H H H H
charge: 0
multiplicity: 1
keywords: wb97x-d3
keywords: def2-TZVPP
keywords: def2/J RIJCOSX
keywords: DEFGRID2
keywords: scfconv7
keywords: smallprint printgap noloewdin
keywords: NOSOSCF
formula: C12H16N3O3PS
InChI: InChI=1/C12H16N3O3PS/c1-3-16-19(20,17-4-2)18-12-13-10-15(14-12)11-8-6-5-7-9-11/h5-10H,3-4H2,1-2H3
36 atoms
S  2.611456 -0.755263 -1.628879
P  2.299232 0.098325 0.057843
O  0.831288 0.796691 0.239203
O  2.372694 -0.763903 1.385873
O  3.203809 1.351121 0.421541
N  -2.340282 -0.214282 -0.046809
N  -1.435973 0.778676 -0.017616
N  -0.425936 -1.210019 0.203392
C  -3.72124 0.059788 -0.160704
C  -0.323238 0.121783 0.134467
C  3.230188 -1.920704 1.514281
C  3.82303 2.200613 -0.570226
C  -1.717628 -1.391381 0.085103
C  -4.623505 -0.975863 -0.378136
C  -4.169402 1.369872 -0.046883
C  -5.977397 -0.693699 -0.463947
C  -5.52683 1.636733 -0.144904
C  2.446832 -3.193406 1.322997
C  5.269957 1.823268 -0.755661
C  -6.437191 0.610595 -0.349263
H  4.059614 -1.860689 0.806806
H  3.648142 -1.859767 2.518294
H  3.277153 2.147083 -1.513529
H  3.724063 3.215195 -0.186364
H  -2.221476 -2.343604 0.105807
H  -4.294017 -2.000101 -0.48979
H  -3.469869 2.176621 0.119599
H  3.104719 -4.044788 1.500431
H  1.615936 -3.261397 2.025194
H  2.055707 -3.27628 0.30963
H  5.815971 1.863723 0.187399
H  5.372109 0.823033 -1.176581
H  5.74022 2.527209 -1.443679
H  -6.674095 -1.504829 -0.629954
H  -5.870135 2.659015 -0.055346
H  -7.4954 0.824359 -0.420814
elementType: S P O N C H
totalener: -1596.60130366 hartree
nucrepener: 1867.52921470 hartree
electener: -3464.13051836 hartree
oneelecener: -5903.33160481 hartree
twoeener: 2439.20108645 hartree
cpcmener: -0.02689235 hartree
kineticenergy: 1591.52988319 hartree
xcener: -117.724848253528 hartree
chargesum: 0.0000000
charge: -0.438547 0.766167 -0.315834 -0.334330 -0.343155 0.150208 -0.329130 -0.408927 0.162445 0.338652 0.048490 0.043660 0.107667 -0.206860 -0.187974 -0.136590 -0.131747 -0.239286 -0.233283 -0.171192 0.088163 0.106945 0.087099 0.106930 0.170534 0.144929 0.151772 0.100953 0.087066 0.075817 0.089290 0.076208 0.094694 0.159495 0.159752 0.159920
qa: -0.4385 0.7662 -0.3158 -0.3343 -0.3432 0.1502 -0.3291 -0.4089 0.1624 0.3387 0.0485 0.0437 0.1077 -0.2069 -0.1880 -0.1366 -0.1317 -0.2393 -0.2333 -0.1712 0.0882 0.1069 0.0871 0.1069 0.1705 0.1449 0.1518 0.1010 0.0871 0.0758 0.0893 0.0762 0.0947 0.1595 0.1598 0.1599
va: 1.9756 5.4761 2.1635 2.1048 2.1149 3.4113 2.8596 3.0138 3.7688 4.2380 3.8523 3.8508 4.0503 3.9759 3.9348 3.9098 3.9195 3.9083 3.9208 3.9189 1.0090 0.9964 1.0130 0.9959 0.9903 1.0068 1.0315 1.0107 1.0068 1.0202 1.0041 1.0183 1.0086 0.9906 0.9910 0.9891
dispcorr: -0.014936363 hartree
energy: -1596.616240024819
dipole: 6.07627 -6.98706 -0.91079 -2.98841 2.47137 -0.51704 2.11505 -1.59202 0.52302
magnitude: 1.17065 au
magnitude: 2.97555 debye
