program: Orca
programVersion: 5.0.2
elementType: S P O O O N N N C C C C C C C C C C C C H H H H H H H H H H H H H H H H
charge: 0
multiplicity: 1
keywords: wb97x-d3
keywords: def2-TZVPP
keywords: def2/J RIJCOSX
keywords: DEFGRID2
keywords: scfconv7
keywords: smallprint printgap noloewdin
keywords: NOSOSCF
formula: C12H16N3O3PS
InChI: InChI=1/C12H16N3O3PS/c1-3-16-19(20,17-4-2)18-12-13-10-15(14-12)11-8-6-5-7-9-11/h5-10H,3-4H2,1-2H3
36 atoms
S  2.581681 -0.814462 -1.616724
P  2.297738 0.049235 0.070326
O  0.839353 0.757776 0.267712
O  2.390198 -0.806547 1.399503
O  3.214613 1.295789 0.415731
N  -2.344128 -0.210118 -0.031589
N  -1.42695 0.770667 -0.007943
N  -0.444809 -1.228657 0.242007
C  -3.720058 0.080782 -0.161773
C  -0.324413 0.101632 0.160113
C  3.260301 -1.953351 1.528045
C  3.726711 2.204715 -0.581544
C  -1.737448 -1.394404 0.117469
C  -4.635842 -0.94834 -0.35245
C  -4.150665 1.399711 -0.0890
C  -5.985323 -0.650862 -0.451386
C  -5.504246 1.681483 -0.198299
C  2.480273 -3.233687 1.377843
C  5.181226 1.917879 -0.851252
C  -6.427895 0.662021 -0.374408
H  4.071292 -1.900637 0.798912
H  3.702452 -1.871622 2.520169
H  3.137956 2.141322 -1.498673
H  3.589046 3.203572 -0.168555
H  -2.253649 -2.339745 0.142588
H  -4.319683 -1.979659 -0.431423
H  -3.440517 2.201367 0.055962
H  3.148339 -4.078904 1.547531
H  1.670283 -3.296221 2.104894
H  2.060813 -3.332736 0.377122
H  5.317873 0.93162 -1.294798
H  5.57031 2.658391 -1.551223
H  5.775494 1.976536 0.061121
H  -6.692444 -1.457147 -0.59515
H  -5.834563 2.710262 -0.139733
H  -7.483088 0.887401 -0.453664
elementType: S P O N C H
totalener: -1596.60186207 hartree
nucrepener: 1866.82863667 hartree
electener: -3463.43049874 hartree
oneelecener: -5901.90970355 hartree
twoeener: 2438.47920481 hartree
cpcmener: -0.02695195 hartree
kineticenergy: 1591.54206699 hartree
xcener: -117.727111175133 hartree
chargesum: -0.0000000
charge: -0.440446 0.766615 -0.314198 -0.333838 -0.341663 0.150271 -0.328227 -0.408378 0.162740 0.338482 0.048303 0.042452 0.106995 -0.206698 -0.187423 -0.136697 -0.131970 -0.240398 -0.232329 -0.171455 0.088112 0.106963 0.086762 0.106295 0.170529 0.144397 0.151874 0.100426 0.088152 0.076190 0.075777 0.094116 0.089327 0.159493 0.159566 0.159882
qa: -0.4404 0.7666 -0.3142 -0.3338 -0.3417 0.1503 -0.3282 -0.4084 0.1627 0.3385 0.0483 0.0425 0.1070 -0.2067 -0.1874 -0.1367 -0.1320 -0.2404 -0.2323 -0.1715 0.0881 0.1070 0.0868 0.1063 0.1705 0.1444 0.1519 0.1004 0.0882 0.0762 0.0758 0.0941 0.0893 0.1595 0.1596 0.1599
va: 1.9743 5.4815 2.1629 2.1085 2.1169 3.4105 2.8593 3.0150 3.7711 4.2367 3.8508 3.8542 4.0522 3.9753 3.9336 3.9097 3.9203 3.9106 3.9252 3.9187 1.0099 0.9965 1.0119 0.9962 0.9906 1.0072 1.0316 1.0107 1.0060 1.0196 1.0181 1.0086 1.0040 0.9907 0.9911 0.9891
dispcorr: -0.014886134 hartree
energy: -1596.616748202051
dipole: 5.83755 -6.80681 -0.96925 -2.46739 2.03270 -0.43469 1.87505 -1.35591 0.51914
magnitude: 1.18233 au
magnitude: 3.00525 debye
