program: Orca
programVersion: 5.0.2
elementType: S P O O O N N N C C C C C C C C C C C C H H H H H H H H H H H H H H H H
charge: 0
multiplicity: 1
keywords: wb97x-d3
keywords: def2-TZVPP
keywords: def2/J RIJCOSX
keywords: DEFGRID2
keywords: scfconv7
keywords: smallprint printgap noloewdin
keywords: NOSOSCF
formula: C12H16N3O3PS
InChI: InChI=1/C12H16N3O3PS/c1-3-16-19(20,17-4-2)18-12-13-10-15(14-12)11-8-6-5-7-9-11/h5-10H,3-4H2,1-2H3
36 atoms
S  2.505098 -0.859906 -1.597506
P  2.275216 0.027892 0.085146
O  0.82249 0.731258 0.328077
O  2.419103 -0.809529 1.421236
O  3.19595 1.286105 0.378231
N  -2.365875 -0.20397 0.006225
N  -1.433995 0.76183 -0.002644
N  -0.492011 -1.236766 0.3803
C  -3.73348 0.100122 -0.167154
C  -0.347488 0.0844 0.227434
C  3.32359 -1.9297 1.546822
C  3.645839 2.188784 -0.655187
C  -1.785421 -1.387532 0.235925
C  -4.628078 -0.901756 -0.52386
C  -4.173042 1.403709 0.025829
C  -5.972294 -0.595333 -0.665253
C  -5.518794 1.697114 -0.133231
C  2.574569 -3.23197 1.433417
C  5.101085 1.945557 -0.959121
C  -6.424347 0.702612 -0.47308
H  4.117269 -1.86646 0.799742
H  3.784499 -1.821091 2.527804
H  3.03504 2.07979 -1.553274
H  3.483256 3.192533 -0.26374
H  -2.326163 -2.317184 0.307613
H  -4.292997 -1.91473 -0.703242
H  -3.476197 2.182817 0.301132
H  1.778355 -3.300633 2.175002
H  2.141112 -3.360442 0.442008
H  3.266268 -4.056988 1.607516
H  5.441595 2.673848 -1.696207
H  5.7198 2.058296 -0.068397
H  5.261041 0.949639 -1.372463
H  -6.665718 -1.379047 -0.940201
H  -5.858368 2.713517 0.017095
H  -7.473827 0.937323 -0.591769
elementType: S P O N C H
totalener: -1596.60252650 hartree
nucrepener: 1865.73045937 hartree
electener: -3462.33298587 hartree
oneelecener: -5899.74492107 hartree
twoeener: 2437.41193520 hartree
cpcmener: -0.02731687 hartree
kineticenergy: 1591.54499142 hartree
xcener: -117.726282747507 hartree
chargesum: -0.0000000
charge: -0.439867 0.764643 -0.313013 -0.333334 -0.342700 0.144221 -0.324495 -0.408503 0.158399 0.331503 0.047771 0.044069 0.108588 -0.204650 -0.189817 -0.131475 -0.127407 -0.242028 -0.231998 -0.170688 0.088920 0.106927 0.086110 0.106373 0.171812 0.146026 0.150174 0.088630 0.077214 0.100166 0.093798 0.089345 0.075764 0.159528 0.159959 0.160034
qa: -0.4399 0.7646 -0.3130 -0.3333 -0.3427 0.1442 -0.3245 -0.4085 0.1584 0.3315 0.0478 0.0441 0.1086 -0.2046 -0.1898 -0.1315 -0.1274 -0.2420 -0.2320 -0.1707 0.0889 0.1069 0.0861 0.1064 0.1718 0.1460 0.1502 0.0886 0.0772 0.1002 0.0938 0.0893 0.0758 0.1595 0.1600 0.1600
va: 1.9753 5.4848 2.1595 2.1106 2.1160 3.4094 2.8643 3.0139 3.7423 4.2456 3.8515 3.8517 4.0486 3.9821 3.9557 3.9079 3.9146 3.9129 3.9285 3.9190 1.0090 0.9964 1.0127 0.9962 0.9885 1.0053 1.0289 1.0056 1.0190 1.0107 1.0085 1.0040 1.0171 0.9906 0.9908 0.9893
dispcorr: -0.014859773 hartree
energy: -1596.617386273848
dipole: 6.03329 -7.02761 -0.99432 -2.14659 1.78147 -0.36512 1.35834 -0.89124 0.46711
magnitude: 1.15766 au
magnitude: 2.94253 debye
