program: Orca
programVersion: 5.0.2
elementType: S P O O O N N N C C C C C C C C C C C C H H H H H H H H H H H H H H H H
charge: 0
multiplicity: 1
keywords: wb97x-d3
keywords: def2-TZVPP
keywords: def2/J RIJCOSX
keywords: DEFGRID2
keywords: scfconv7
keywords: smallprint printgap noloewdin
keywords: NOSOSCF
formula: C12H16N3O3PS
InChI: InChI=1/C12H16N3O3PS/c1-3-16-19(20,17-4-2)18-12-13-10-15(14-12)11-8-6-5-7-9-11/h5-10H,3-4H2,1-2H3
36 atoms
S  2.533304 -0.020551 -2.163046
P  2.38491 -0.312448 -0.280599
O  0.906245 -0.800525 0.249712
O  3.247276 -1.531493 0.236436
O  2.732485 0.885472 0.701794
N  -2.183685 0.438196 -0.035065
N  -1.368687 -0.609211 0.175341
N  -0.176242 1.257213 -0.172002
C  -3.587384 0.278491 -0.023134
C  -0.194661 -0.056987 0.082597
C  3.340492 -1.952321 1.621087
C  2.963485 2.247541 0.282436
C  -1.453519 1.540694 -0.240897
C  -4.129332 -0.964778 0.278672
C  -4.417524 1.355057 -0.315668
C  -5.507058 -1.122812 0.290214
C  -5.791969 1.181424 -0.296359
C  2.678107 -3.293146 1.802593
C  4.433422 2.504764 0.078239
C  -6.344894 -0.055007 0.005884
H  4.406374 -2.007885 1.83934
H  2.907114 -1.207614 2.290204
H  2.395972 2.460107 -0.623594
H  2.55912 2.865039 1.083311
H  -1.870763 2.516208 -0.430223
H  -3.487475 -1.804561 0.502526
H  -4.017448 2.32921 -0.560807
H  3.098439 -4.041712 1.130687
H  2.845012 -3.633824 2.825367
H  1.601841 -3.241466 1.639827
H  5.010703 2.282276 0.976141
H  4.831527 1.916789 -0.749338
H  4.581297 3.559094 -0.160487
H  -5.922958 -2.093742 0.525259
H  -6.431553 2.02406 -0.523372
H  -7.418982 -0.184198 0.017867
elementType: S P O N C H
totalener: -1596.60184157 hartree
nucrepener: 1873.47105544 hartree
electener: -3470.07289700 hartree
oneelecener: -5914.88211885 hartree
twoeener: 2444.80922185 hartree
cpcmener: -0.02709301 hartree
kineticenergy: 1591.52398080 hartree
xcener: -117.723770437404 hartree
chargesum: -0.0000000
charge: -0.420817 0.723013 -0.310693 -0.341945 -0.334168 0.151982 -0.333975 -0.410347 0.165133 0.354187 0.040412 0.058314 0.104662 -0.188445 -0.208841 -0.133434 -0.139072 -0.243322 -0.235740 -0.171409 0.105998 0.099802 0.084764 0.109062 0.170780 0.153813 0.144824 0.088387 0.092943 0.085523 0.088414 0.077013 0.093369 0.159850 0.159899 0.160065
qa: -0.4208 0.7230 -0.3107 -0.3419 -0.3342 0.1520 -0.3340 -0.4103 0.1651 0.3542 0.0404 0.0583 0.1047 -0.1884 -0.2088 -0.1334 -0.1391 -0.2433 -0.2357 -0.1714 0.1060 0.0998 0.0848 0.1091 0.1708 0.1538 0.1448 0.0884 0.0929 0.0855 0.0884 0.0770 0.0934 0.1598 0.1599 0.1601
va: 2.0126 5.5040 2.1312 2.1262 2.0694 3.4129 2.8489 3.0170 3.7791 4.2063 3.8502 3.8170 4.0561 3.9258 3.9730 3.9207 3.9132 3.9372 3.9476 3.9183 0.9952 1.0009 1.0201 0.9925 0.9913 1.0320 1.0076 1.0040 1.0075 1.0105 1.0047 1.0168 1.0085 0.9910 0.9906 0.9889
dispcorr: -0.015072591 hartree
energy: -1596.616914159947
dipole: 2.56802 -4.04499 -1.47697 1.73847 -0.38926 1.34921 9.81522 -7.99699 1.81823
magnitude: 2.70329 au
magnitude: 6.87122 debye
