program: Orca
programVersion: 5.0.2
elementType: S P O O O N N N C C C C C C C C C C C C H H H H H H H H H H H H H H H H
charge: 0
multiplicity: 1
keywords: wb97x-d3
keywords: def2-TZVPP
keywords: def2/J RIJCOSX
keywords: DEFGRID2
keywords: scfconv7
keywords: smallprint printgap noloewdin
keywords: NOSOSCF
formula: C12H16N3O3PS
InChI: InChI=1/C12H16N3O3PS/c1-3-16-19(20,17-4-2)18-12-13-10-15(14-12)11-8-6-5-7-9-11/h5-10H,3-4H2,1-2H3
36 atoms
S  2.625638 -1.156488 -1.525342
P  2.375469 -0.215107 0.123145
O  0.97944 0.633276 0.240455
O  2.365379 -1.025683 1.484773
O  3.397931 0.949365 0.462673
N  -2.262265 -0.118936 -0.037273
N  -1.275615 0.790799 -0.07488
N  -0.449403 -1.249545 0.354035
C  -3.610421 0.259691 -0.216912
C  -0.228657 0.057452 0.166815
C  2.766154 -2.406024 1.595231
C  4.009367 1.784394 -0.541394
C  -1.7500 -1.328226 0.218648
C  -4.572703 -0.704222 -0.493475
C  -3.963701 1.598865 -0.11153
C  -5.895885 -0.321704 -0.645158
C  -5.289954 1.967112 -0.27934
C  4.259466 -2.536233 1.748904
C  3.054924 2.800034 -1.116695
C  -6.261553 1.01281 -0.541224
H  2.244532 -2.779478 2.474885
H  2.406043 -2.96469 0.730076
H  4.830822 2.274464 -0.022245
H  4.434831 1.153421 -1.324108
H  -2.342143 -2.223897 0.313047
H  -4.307903 -1.747278 -0.602349
H  -3.215337 2.348863 0.101447
H  4.623532 -1.978981 2.61191
H  4.512946 -3.58659 1.898115
H  4.789563 -2.19066 0.860798
H  3.613143 3.473405 -1.76739
H  2.27286 2.338668 -1.719854
H  2.589384 3.401417 -0.336125
H  -6.641335 -1.07631 -0.857733
H  -5.561658 3.011252 -0.197535
H  -7.29524 1.306353 -0.667037
elementType: S P O N C H
totalener: -1596.60306230 hartree
nucrepener: 1875.17036770 hartree
electener: -3471.77342999 hartree
oneelecener: -5918.57753701 hartree
twoeener: 2446.80410702 hartree
cpcmener: -0.02630011 hartree
kineticenergy: 1591.55244433 hartree
xcener: -117.729271849331 hartree
chargesum: 0.0000000
charge: -0.436127 0.766190 -0.315999 -0.342754 -0.340740 0.143852 -0.328012 -0.409153 0.159634 0.343630 0.042001 0.029256 0.104444 -0.203981 -0.189471 -0.133075 -0.128305 -0.235593 -0.236304 -0.171170 0.108823 0.091117 0.107932 0.093178 0.171681 0.145086 0.150329 0.090371 0.094826 0.078941 0.097878 0.081426 0.090914 0.159479 0.159672 0.160029
qa: -0.4361 0.7662 -0.3160 -0.3428 -0.3407 0.1439 -0.3280 -0.4092 0.1596 0.3436 0.0420 0.0293 0.1044 -0.2040 -0.1895 -0.1331 -0.1283 -0.2356 -0.2363 -0.1712 0.1088 0.0911 0.1079 0.0932 0.1717 0.1451 0.1503 0.0904 0.0948 0.0789 0.0979 0.0814 0.0909 0.1595 0.1597 0.1600
va: 1.9867 5.4728 2.1530 2.1060 2.1227 3.4103 2.8631 3.0218 3.7497 4.2280 3.8456 3.8677 4.0558 3.9793 3.9494 3.9084 3.9158 3.9317 3.8916 3.9193 0.9923 1.0148 0.9916 1.0103 0.9888 1.0059 1.0300 1.0056 1.0081 1.0163 1.0088 1.0159 1.0064 0.9907 0.9909 0.9892
dispcorr: -0.014978064 hartree
energy: -1596.618040362669
dipole: 4.09609 -5.36006 -1.26397 1.66280 -2.01027 -0.34747 1.72276 -1.22120 0.50157
magnitude: 1.40354 au
magnitude: 3.56752 debye
