program: Orca
programVersion: 5.0.2
elementType: S P O O O N N N C C C C C C C C C C C C H H H H H H H H H H H H H H H H
charge: 0
multiplicity: 1
keywords: wb97x-d3
keywords: def2-TZVPP
keywords: def2/J RIJCOSX
keywords: DEFGRID2
keywords: scfconv7
keywords: smallprint printgap noloewdin
keywords: NOSOSCF
formula: C12H16N3O3PS
InChI: InChI=1/C12H16N3O3PS/c1-3-16-19(20,17-4-2)18-12-13-10-15(14-12)11-8-6-5-7-9-11/h5-10H,3-4H2,1-2H3
36 atoms
S  2.512175 -0.511029 -1.903193
P  2.228743 0.233304 -0.161368
O  0.759195 0.905718 0.09817
O  2.457139 -0.712156 1.093252
O  3.028728 1.546016 0.231902
N  -2.387328 -0.211292 -0.020208
N  -1.520408 0.815146 -0.001475
N  -0.424628 -1.138537 0.056975
C  -3.781016 0.017784 -0.05997
C  -0.376442 0.198772 0.047221
C  2.45476 -2.155255 1.057785
C  4.370026 1.797712 -0.234715
C  -1.714124 -1.367486 0.014296
C  -4.66512 -1.049477 -0.176984
C  -4.259408 1.31994 0.018342
C  -6.028599 -0.804597 -0.209795
C  -5.626665 1.548236 -0.020221
C  3.824241 -2.678294 1.404849
C  5.385607 0.831469 0.323664
C  -6.517805 0.491697 -0.132753
H  1.710237 -2.478784 1.784106
H  2.140616 -2.509719 0.076091
H  4.377238 1.787497 -1.326354
H  4.582147 2.813975 0.092407
H  -2.178439 -2.339726 0.011892
H  -4.316246 -2.070611 -0.247909
H  -3.574881 2.151155 0.108278
H  4.163445 -2.315353 2.375435
H  3.785495 -3.767651 1.452106
H  4.561994 -2.404357 0.650292
H  5.35295 0.793303 1.412494
H  5.255146 -0.177617 -0.06834
H  6.381771 1.165563 0.030821
H  -6.710617 -1.639689 -0.30087
H  -5.992292 2.564826 0.040842
H  -7.583635 0.675361 -0.161188
elementType: S P O N C H
totalener: -1596.60139851 hartree
nucrepener: 1870.93686532 hartree
electener: -3467.53826383 hartree
oneelecener: -5909.89900317 hartree
twoeener: 2442.36073935 hartree
cpcmener: -0.02628836 hartree
kineticenergy: 1591.53718959 hartree
xcener: -117.728627463811 hartree
chargesum: 0.0000000
charge: -0.437279 0.741511 -0.313866 -0.331415 -0.338736 0.152470 -0.330400 -0.413473 0.163034 0.348021 0.076576 0.029037 0.103845 -0.206978 -0.186699 -0.139874 -0.133312 -0.253844 -0.243724 -0.170580 0.097210 0.086253 0.097348 0.109786 0.171022 0.145149 0.153083 0.091814 0.099101 0.083503 0.094560 0.075243 0.102554 0.159563 0.159581 0.159917
qa: -0.4373 0.7415 -0.3139 -0.3314 -0.3387 0.1525 -0.3304 -0.4135 0.1630 0.3480 0.0766 0.0290 0.1038 -0.2070 -0.1867 -0.1399 -0.1333 -0.2538 -0.2437 -0.1706 0.0972 0.0863 0.0973 0.1098 0.1710 0.1451 0.1531 0.0918 0.0991 0.0835 0.0946 0.0752 0.1026 0.1596 0.1596 0.1599
va: 1.9823 5.5036 2.1663 2.0871 2.1196 3.4116 2.8557 3.0116 3.7807 4.2182 3.7976 3.8597 4.0551 3.9740 3.9256 3.9123 3.9224 3.9531 3.8866 3.9188 0.9979 1.0201 1.0082 0.9920 0.9912 1.0074 1.0323 1.0030 1.0094 1.0024 1.0057 1.0129 1.0100 0.9908 0.9912 0.9890
dispcorr: -0.015535943 hartree
energy: -1596.616934451118
dipole: 9.33520 -10.22059 -0.88539 -6.59250 5.34094 -1.25156 6.34254 -5.41367 0.92888
magnitude: 1.79252 au
magnitude: 4.55623 debye
