program: Orca
programVersion: 5.0.2
elementType: S P O O O N N N C C C C C C C C C C C C H H H H H H H H H H H H H H H H
charge: 0
multiplicity: 1
keywords: wb97x-d3
keywords: def2-TZVPP
keywords: def2/J RIJCOSX
keywords: DEFGRID2
keywords: scfconv7
keywords: smallprint printgap noloewdin
keywords: NOSOSCF
formula: C12H16N3O3PS
InChI: InChI=1/C12H16N3O3PS/c1-3-16-19(20,17-4-2)18-12-13-10-15(14-12)11-8-6-5-7-9-11/h5-10H,3-4H2,1-2H3
36 atoms
S  1.380705 -2.264073 0.493695
P  1.946038 -0.433553 0.479356
O  1.0899 0.597864 1.415378
O  3.332333 -0.061645 1.154149
O  2.003261 0.294152 -0.932192
N  -2.093578 0.926671 0.400501
N  -0.867914 0.432191 0.166155
N  -0.896349 1.576217 2.095323
C  -3.168866 0.654354 -0.471252
C  -0.208705 0.851561 1.2077
C  4.530125 -0.810684 0.850144
C  1.476397 -0.250855 -2.158765
C  -2.090165 1.601854 1.555063
C  -3.168274 -0.526786 -1.202315
C  -4.215619 1.560264 -0.583093
C  -4.234111 -0.801398 -2.044772
C  -5.282447 1.263745 -1.417439
C  4.875972 -1.740934 1.98361
C  2.54248 -1.003376 -2.912287
C  -5.295991 0.08609 -2.151501
H  4.417509 -1.361428 -0.086777
H  5.309619 -0.065354 0.697637
H  0.61783 -0.88817 -1.948183
H  1.123093 0.610229 -2.724586
H  -2.966988 2.074627 1.968354
H  -2.350552 -1.228578 -1.108797
H  -4.201839 2.496084 -0.039421
H  4.994496 -1.19949 2.922445
H  4.116294 -2.510868 2.116912
H  5.822181 -2.23656 1.763034
H  2.870268 -1.88771 -2.364922
H  2.137097 -1.336219 -3.868603
H  3.410216 -0.3760 -3.11707
H  -4.234828 -1.721461 -2.614203
H  -6.099645 1.967753 -1.502083
H  -6.127994 -0.13753 -2.805919
elementType: S P O N C H
totalener: -1596.60250014 hartree
nucrepener: 1906.23707978 hartree
electener: -3502.83957993 hartree
oneelecener: -5980.30519778 hartree
twoeener: 2477.46561785 hartree
cpcmener: -0.02733308 hartree
kineticenergy: 1591.55042529 hartree
xcener: -117.727432491270 hartree
chargesum: -0.0000000
charge: -0.433614 0.747260 -0.313101 -0.332848 -0.339925 0.123341 -0.361489 -0.383270 0.161154 0.352158 0.043763 0.064762 0.100033 -0.190557 -0.202575 -0.126373 -0.129131 -0.234218 -0.246270 -0.166190 0.084750 0.107569 0.085904 0.110425 0.177711 0.142646 0.150613 0.090690 0.076170 0.093501 0.076378 0.098483 0.092822 0.159422 0.159788 0.160218
qa: -0.4336 0.7473 -0.3131 -0.3328 -0.3399 0.1233 -0.3615 -0.3833 0.1612 0.3522 0.0438 0.0648 0.1000 -0.1906 -0.2026 -0.1264 -0.1291 -0.2342 -0.2463 -0.1662 0.0848 0.1076 0.0859 0.1104 0.1777 0.1426 0.1506 0.0907 0.0762 0.0935 0.0764 0.0985 0.0928 0.1594 0.1598 0.1602
va: 1.9819 5.5081 2.1721 2.1172 2.0880 3.4395 2.8279 3.0475 3.6940 4.2224 3.8798 3.8209 4.0410 3.9699 3.9849 3.9174 3.9078 3.9344 3.9379 3.9152 0.9971 0.9954 1.0102 0.9930 0.9883 1.0232 1.0027 1.0043 1.0184 1.0080 1.0152 1.0102 1.0035 0.9903 0.9904 0.9892
dispcorr: -0.016043413 hartree
energy: -1596.618543556945
dipole: 6.98347 -7.99807 -1.01460 -5.53347 5.91616 0.38269 -12.01947 10.10448 -1.91499
magnitude: 2.20069 au
magnitude: 5.59372 debye
