program: Gaussian 09
title: 000066931
version: EM64L-G09RevD.01
frameworkgroup: C1[X(C10H25N3)]
method: RPBEPBE
basis: SDD
operation: Freq
keyword: #pfreq=noraman
keyword: PBEPBE/SDD
title: #p freq=noraman PBEPBE/SDD
converged: YES YES NO NO
title: Mulliken charges:
elementType: N N N C C C C C C C C C C H H H H H H H H H H H H H H H H H H H H H H H H H
charge: -0.105882 -0.280535 -0.281405 -0.384054 -0.376977 -0.330825 -0.369788 -0.370568 -0.673277 -0.319374 -0.319597 -0.689370 -0.690003 0.175618 0.228726 0.175487 0.226091 0.186948 0.205395 0.223564 0.180297 0.222843 0.187040 0.236065 0.236120 0.213338 0.225987 0.203983 0.211029 0.176998 0.210669 0.177655 0.231590 0.201284 0.211045 0.231359 0.201564 0.210959
chargesum: 0.00000
title: Mulliken charges with hydrogens summed into heavy atoms:
elementType: N N N C C C C C C C C C C
charge: -0.105882 -0.044470 -0.045285 0.020290 0.024602 0.061518 0.034073 0.039315 -0.029969 0.068654 0.068726 -0.045450 -0.046122
polarizability: 1.59654432e+02 -2.34611379e-01 1.34146627e+02 2.98601314e-01 1.89509679e-01 1.13777470e+02
1716.lowfreq: -6.1306 -0.0010 -0.0007 -0.0007 2.4335 13.4728 22.7660 37.5593 46.6797
frequency: 22.5066 37.5315 46.6181 59.3697 60.3568 88.1811 99.6711 110.5134 128.9284 138.0480 140.1694 193.3990 225.9211 247.5518 250.5060 265.7591 276.3530 302.8413 349.5230 390.3875 415.3569 469.8566 494.2808 523.6845 672.7480 679.6580 775.4344 795.0966 799.8297 804.2934 813.9757 819.8097 900.6437 904.2274 959.0964 1021.8563 1030.6337 1036.9241 1043.3881 1060.0688 1067.7877 1083.4560 1095.4220 1111.5084 1114.8746 1122.3496 1149.2428 1151.4542 1159.8692 1192.2446 1199.6758 1229.4105 1240.1732 1262.9161 1267.9491 1276.2729 1288.4715 1293.0381 1310.8878 1315.3217 1352.3851 1357.6088 1368.0501 1383.0412 1386.3319 1386.7649 1392.1958 1397.9093 1442.4728 1445.6017 1459.0362 1466.5625 1470.3360 1471.7396 1472.2988 1476.0257 1479.9602 1481.1395 1485.3749 1489.2050 1490.3430 1498.8740 1499.8727 2830.7944 2837.8676 2847.4470 2848.5358 2855.5141 2858.0513 2859.7446 2976.8049 2977.7579 2982.5554 2998.6494 2998.8210 3021.8862 3023.7942 3024.3258 3052.4644 3057.8875 3069.0354 3069.9906 3075.7831 3091.1033 3091.5231 3091.5477 3413.0616 3414.1218
redmass: 3.6452 2.1755 2.4745 2.3285 1.8000 2.2461 2.7365 3.2211 2.0313 2.1203 2.4031 1.6299 2.0802 1.1516 1.1622 2.0523 2.3634 2.9447 3.1091 2.6860 2.9531 2.9546 2.7483 2.9884 1.3646 1.3478 1.8207 1.1412 1.1372 1.2160 1.1298 1.3601 1.7348 1.7107 2.1372 2.3824 3.2744 2.8087 1.6601 2.1213 2.4043 2.2149 1.9217 1.6009 1.9517 2.1333 2.5126 3.0697 1.8915 2.1281 2.0460 1.5291 1.4300 1.1751 1.2079 1.1140 1.1708 1.2137 1.3077 1.3272 1.3455 1.3446 1.3388 1.2801 1.2630 1.2374 1.3745 1.4515 1.1966 1.1903 1.0569 1.0725 1.0557 1.0568 1.0656 1.0646 1.0524 1.0528 1.0712 1.0820 1.0865 1.0850 1.0846 1.0718 1.0717 1.0721 1.0723 1.0712 1.0716 1.0711 1.0374 1.0373 1.0357 1.0861 1.0862 1.0861 1.0859 1.0870 1.0890 1.0897 1.0978 1.0979 1.0982 1.1003 1.1002 1.1002 1.0737 1.0737
irintensity: 0.1303 0.6771 0.1501 0.7302 1.1991 0.8584 1.1846 0.9690 3.3249 1.8153 3.3663 0.1324 0.1437 0.7430 0.4341 1.4734 1.2686 0.4414 3.6308 1.4716 3.5419 10.6984 4.4807 1.1952 99.4321 95.3736 3.8130 4.4330 3.1887 4.4852 8.1714 1.6521 0.7270 2.3888 10.0102 4.7842 4.4270 23.8923 28.8660 18.4599 19.8550 19.1640 9.6970 21.7189 7.7624 13.9071 26.5101 77.7939 12.6721 6.5340 15.6133 17.0919 14.1150 3.7779 8.1895 0.6003 26.7849 23.1289 3.7207 3.7519 0.4805 0.7733 4.2023 4.6654 34.0275 7.7073 26.1700 1.5189 38.6599 24.3085 1.3981 9.6662 16.0323 14.9338 4.6298 5.9311 11.3534 7.0628 6.7353 2.5806 8.8623 4.5913 4.0204 70.0027 75.2632 72.8165 61.6418 228.3923 87.8447 214.9051 35.2382 33.1401 31.7079 24.0609 32.3231 10.7443 34.2108 23.8560 23.7510 51.7579 56.9118 60.6150 59.0393 35.2314 38.7915 45.8650 3.1562 3.1108
temp: 298.150 k
press: 1.00000 atm
elementType: 7 7 7 6 6 6 6 6 6 6 6 6 6 1 1 1 1 1 1 1 1 1 1 1 1 1 1 1 1 1 1 1 1 1 1 1 1 1
symmnumber: 1
zpe: 908620.7 jmol-1
zpe.correction: 0.346075 hartree
zpe.thermalcorrener: 0.363932 hartree
zpe.thermalcorrenthalpy: 0.364876 hartree
zpe.thermalcorrgfe: 0.298042 hartree
zpe.sumelectzpe: -559.147822 hartree
zpe.sumelectthermal: -559.129965 hartree
zpe.sumelectthermalent: -559.129021 hartree
zpe.sumelectthermalfe: -559.195855 hartree
dipole: 1.0355 0.1363 -0.7287
dipole: 1.2735
quadrupole: -82.0488 -84.0064 -82.7947
quadrupole: 5.6111 -0.1883 -1.5841
quadrupole: 0.9012 -1.0564 0.1552 5.6111 -0.1883 -1.5841
hfenergy: -559.493897 hartree
pointgroup: C01 [X(C10H25N3)]
dipole: 0.4039669 0.0418116 -0.2934449 debye
polarizability: 159.6528321|-0.3286382|134.1363049|-0.2644775|-0.5345311|113.7893928 unknown
InChI: InChI=1S/C10H25N3/c1-4-11-7-9-13(6-3)10-8-12-5-2/h11-12H,4-10H2,1-3H3
charge 0 multiplicity 1
38 atoms
N  0.015854 1.196428 -0.247617
N  3.208873 -0.866759 -0.361104
N  -3.33445 -0.5991 -0.243454
C  1.019723 0.22829 -0.752964
C  -1.372561 0.861607 -0.646578
C  0.384666 2.611608 -0.516405
C  2.19966 0.042644 0.222541
C  -1.989117 -0.232159 0.248714
C  -0.238445 3.596374 0.49113
C  4.350799 -1.177307 0.526935
C  -4.057428 -1.575921 0.600505
C  5.35236 -2.114077 -0.170006
C  -5.430104 -1.916615 -0.004585
H  1.413906 0.531558 -1.758653
H  0.539386 -0.756098 -0.892538
H  -1.426922 0.537862 -1.719268
H  -2.004178 1.762734 -0.562022
H  0.110619 2.914513 -1.559697
H  1.485946 2.689203 -0.448927
H  1.814699 -0.408147 1.15643
H  2.62065 1.041675 0.503161
H  -2.086013 0.167538 1.275457
H  -1.29259 -1.10645 0.312867
H  3.534819 -0.525985 -1.278072
H  -3.301148 -0.911561 -1.225517
H  -1.342697 3.56313 0.467462
H  0.085913 3.345792 1.516151
H  0.0711 4.633569 0.262275
H  3.949535 -1.672048 1.433497
H  4.883955 -0.256931 0.879272
H  -4.195696 -1.121632 1.601602
H  -3.475561 -2.520127 0.75948
H  4.851061 -3.047213 -0.481317
H  5.78277 -1.638723 -1.072875
H  6.188782 -2.369204 0.50554
H  -6.032878 -0.999642 -0.126682
H  -5.321171 -2.390353 -0.999568
H  -5.982614 -2.620676 0.64353
