program: Orca
programVersion: 5.0.2
elementType: S P O O O N N N C C C C C C C C C C C C H H H H H H H H H H H H H H H H
charge: 0
multiplicity: 1
keywords: wb97x-d3
keywords: def2-TZVPP
keywords: def2/J RIJCOSX
keywords: DEFGRID2
keywords: scfconv7
keywords: smallprint printgap noloewdin
keywords: NOSOSCF
formula: C12H16N3O3PS
InChI: InChI=1/C12H16N3O3PS/c1-3-16-19(20,17-4-2)18-12-13-10-15(14-12)11-8-6-5-7-9-11/h5-10H,3-4H2,1-2H3
36 atoms
S  1.696118 -0.632148 -1.805837
P  2.017399 0.025194 -0.036948
O  1.219593 1.396124 0.376373
O  1.657204 -0.903061 1.197579
O  3.486451 0.495496 0.321169
N  -2.110795 1.000177 0.224274
N  -0.893699 0.436994 0.213876
N  -0.725563 2.66018 0.455598
C  -3.267851 0.218437 0.024634
C  -0.118782 1.473503 0.349537
C  1.424196 -2.32094 1.086854
C  4.453707 0.960019 -0.644171
C  -1.989828 2.324637 0.369311
C  -3.160458 -0.982215 -0.665973
C  -4.494044 0.649633 0.513731
C  -4.296228 -1.748599 -0.873318
C  -5.623589 -0.121347 0.28602
C  2.708965 -3.100286 0.966408
C  5.649484 0.044366 -0.63983
C  -5.530894 -1.320639 -0.406047
H  0.892298 -2.583164 1.999805
H  0.760063 -2.517241 0.243545
H  4.00449 1.008126 -1.637229
H  4.725684 1.973147 -0.349055
H  -2.830608 2.999697 0.391126
H  -2.202711 -1.313025 -1.043851
H  -4.57599 1.568122 1.080137
H  3.221075 -2.899424 0.025049
H  3.390316 -2.881546 1.788474
H  2.481051 -4.166248 0.995707
H  6.39684 0.427034 -1.335798
H  6.110138 -0.011691 0.346541
H  5.38065 -0.963131 -0.958374
H  -4.212251 -2.682599 -1.413201
H  -6.57937 0.217297 0.663227
H  -6.415381 -1.919659 -0.577623
elementType: S P O N C H
totalener: -1596.60250712 hartree
nucrepener: 1902.07705512 hartree
electener: -3498.67956224 hartree
oneelecener: -5972.21747366 hartree
twoeener: 2473.53791142 hartree
cpcmener: -0.02663910 hartree
kineticenergy: 1591.56304840 hartree
xcener: -117.729822564147 hartree
chargesum: -0.0000000
charge: -0.433442 0.759432 -0.319468 -0.340008 -0.336527 0.125727 -0.357290 -0.381396 0.157807 0.346514 0.044748 0.046731 0.101007 -0.182765 -0.199694 -0.130248 -0.130610 -0.235397 -0.233843 -0.166147 0.109152 0.092445 0.084510 0.105985 0.177205 0.139514 0.148926 0.074642 0.092161 0.097258 0.093347 0.090788 0.081049 0.159366 0.158773 0.159747
qa: -0.4334 0.7594 -0.3195 -0.3400 -0.3365 0.1257 -0.3573 -0.3814 0.1578 0.3465 0.0447 0.0467 0.1010 -0.1828 -0.1997 -0.1302 -0.1306 -0.2354 -0.2338 -0.1661 0.1092 0.0924 0.0845 0.1060 0.1772 0.1395 0.1489 0.0746 0.0922 0.0973 0.0933 0.0908 0.0810 0.1594 0.1588 0.1597
va: 1.9860 5.4859 2.1652 2.1002 2.1223 3.4300 2.8110 3.0465 3.7112 4.2288 3.8526 3.8349 4.0394 3.9626 3.9813 3.9195 3.9084 3.9234 3.9313 3.9125 0.9919 1.0075 1.0178 0.9963 0.9890 1.0267 1.0036 1.0152 1.0059 1.0092 1.0093 1.0038 1.0078 0.9903 0.9908 0.9894
dispcorr: -0.015568186 hartree
energy: -1596.618075307965
dipole: 7.84736 -8.99735 -1.14998 -12.53386 11.69053 -0.84333 0.84575 -0.49933 0.34642
magnitude: 1.46754 au
magnitude: 3.73019 debye
