program: Orca
programVersion: 5.0.2
elementType: S P O O O N N N C C C C C C C C C C C C H H H H H H H H H H H H H H H H
charge: 0
multiplicity: 1
keywords: wb97x-d3
keywords: def2-TZVPP
keywords: def2/J RIJCOSX
keywords: DEFGRID2
keywords: scfconv7
keywords: smallprint printgap noloewdin
keywords: NOSOSCF
formula: C12H16N3O3PS
InChI: InChI=1/C12H16N3O3PS/c1-3-16-19(20,17-4-2)18-12-13-10-15(14-12)11-8-6-5-7-9-11/h5-10H,3-4H2,1-2H3
36 atoms
S  2.463098 -0.751386 -1.847376
P  2.221401 0.171673 -0.186389
O  0.762151 0.879204 0.029105
O  2.469994 -0.644985 1.151036
O  3.024172 1.516845 0.055303
N  -2.404181 -0.183257 0.034015
N  -1.514862 0.811837 -0.120723
N  -0.466259 -1.116601 0.333699
C  -3.792458 0.05815 -0.064793
C  -0.386602 0.194007 0.073856
C  2.505811 -2.083114 1.24927
C  4.354689 1.743486 -0.447093
C  -1.759675 -1.324168 0.305079
C  -4.678889 -1.006288 -0.186577
C  -4.262226 1.365344 -0.034984
C  -6.039832 -0.754416 -0.258168
C  -5.626092 1.601222 -0.120146
C  3.929214 -2.573727 1.320328
C  5.406926 1.048519 0.379948
C  -6.52111 0.546763 -0.22633
H  1.957334 -2.327514 2.15836
H  1.976923 -2.534104 0.410088
H  4.406221 1.436813 -1.493942
H  4.481431 2.82413 -0.409185
H  -2.250438 -2.266559 0.486417
H  -4.329168 -2.02871 -0.237678
H  -3.573565 2.193431 0.056358
H  4.475063 -2.112149 2.143822
H  3.925348 -3.651867 1.486559
H  4.466303 -2.382522 0.390859
H  5.362953 -0.036053 0.277226
H  6.391866 1.370558 0.039672
H  5.318607 1.303881 1.436226
H  -6.725451 -1.586679 -0.348925
H  -5.987192 2.621077 -0.09806
H  -7.584568 0.736423 -0.288038
elementType: S P O N C H
totalener: -1596.60216261 hartree
nucrepener: 1868.58718267 hartree
electener: -3465.18934528 hartree
oneelecener: -5905.22213284 hartree
twoeener: 2440.03278756 hartree
cpcmener: -0.02633779 hartree
kineticenergy: 1591.53723282 hartree
xcener: -117.727857692373 hartree
chargesum: 0.0000000
charge: -0.435450 0.734393 -0.310143 -0.332791 -0.336319 0.147781 -0.328678 -0.412847 0.159292 0.343731 0.074647 0.035289 0.106683 -0.205116 -0.188904 -0.134824 -0.129135 -0.262466 -0.245666 -0.170324 0.104914 0.085095 0.091973 0.108412 0.171829 0.145565 0.151096 0.094222 0.103383 0.079464 0.083493 0.100256 0.092236 0.159530 0.159578 0.159803
qa: -0.4355 0.7344 -0.3101 -0.3328 -0.3363 0.1478 -0.3287 -0.4128 0.1593 0.3437 0.0746 0.0353 0.1067 -0.2051 -0.1889 -0.1348 -0.1291 -0.2625 -0.2457 -0.1703 0.1049 0.0851 0.0920 0.1084 0.1718 0.1456 0.1511 0.0942 0.1034 0.0795 0.0835 0.1003 0.0922 0.1595 0.1596 0.1598
va: 1.9879 5.5160 2.1620 2.0844 2.1257 3.4107 2.8596 3.0131 3.7588 4.2242 3.7944 3.8595 4.0517 3.9793 3.9441 3.9091 3.9179 3.9474 3.9026 3.9193 0.9958 1.0209 1.0114 0.9917 0.9890 1.0059 1.0304 1.0010 1.0106 1.0087 1.0037 1.0099 1.0060 0.9906 0.9910 0.9893
dispcorr: -0.015487749 hartree
energy: -1596.617650358231
dipole: 9.73330 -10.61216 -0.87887 -5.32337 4.24804 -1.07532 6.41122 -5.34750 1.06371
magnitude: 1.74935 au
magnitude: 4.44648 debye
