program: Orca
programVersion: 5.0.2
elementType: S P O O O N N N C C C C C C C C C C C C H H H H H H H H H H H H H H H H
charge: 0
multiplicity: 1
keywords: wb97x-d3
keywords: def2-TZVPP
keywords: def2/J RIJCOSX
keywords: DEFGRID2
keywords: scfconv7
keywords: smallprint printgap noloewdin
keywords: NOSOSCF
formula: C12H16N3O3PS
InChI: InChI=1/C12H16N3O3PS/c1-3-16-19(20,17-4-2)18-12-13-10-15(14-12)11-8-6-5-7-9-11/h5-10H,3-4H2,1-2H3
36 atoms
S  1.7189 -0.506765 -1.87282
P  2.003975 0.017199 -0.053138
O  1.206543 1.368975 0.419024
O  1.604686 -0.992016 1.100823
O  3.46617 0.445069 0.382124
N  -2.126122 1.016857 0.221029
N  -0.916221 0.43814 0.219757
N  -0.7220 2.659913 0.45692
C  -3.293857 0.248151 0.032722
C  -0.129539 1.46543 0.361084
C  1.381234 -2.399835 0.888308
C  4.399934 1.082413 -0.518208
C  -1.989761 2.340187 0.360854
C  -3.209692 -0.947599 -0.669447
C  -4.507523 0.688547 0.544238
C  -4.356679 -1.700217 -0.865295
C  -5.649219 -0.067573 0.326139
C  2.675017 -3.171505 0.832669
C  5.417689 0.086636 -1.012283
C  -5.579517 -1.262677 -0.375696
H  0.772309 -2.714782 1.734147
H  0.793806 -2.544477 -0.019978
H  3.871119 1.549167 -1.351234
H  4.87012 1.875343 0.062078
H  -2.822723 3.025282 0.372268
H  -2.261219 -1.283641 -1.065934
H  -4.570599 1.603319 1.119146
H  3.274762 -2.900255 -0.037195
H  3.27299 -3.017423 1.731071
H  2.45051 -4.23644 0.758781
H  6.147514 0.600501 -1.639104
H  5.956116 -0.378842 -0.186156
H  4.952879 -0.695598 -1.612659
H  -4.291072 -2.631213 -1.41288
H  -6.595177 0.276747 0.722715
H  -6.47234 -1.852564 -0.535437
elementType: S P O N C H
totalener: -1596.60294008 hartree
nucrepener: 1903.78887146 hartree
electener: -3500.39181154 hartree
oneelecener: -5975.65242497 hartree
twoeener: 2475.26061343 hartree
cpcmener: -0.02678088 hartree
kineticenergy: 1591.55655051 hartree
xcener: -117.727944206861 hartree
chargesum: 0.0000000
charge: -0.434504 0.762155 -0.318423 -0.338495 -0.339637 0.128196 -0.357352 -0.381451 0.156551 0.343094 0.041707 0.046257 0.100258 -0.182855 -0.200092 -0.129408 -0.130222 -0.234365 -0.238313 -0.165550 0.109279 0.092965 0.088734 0.107037 0.177628 0.140011 0.149310 0.076871 0.091706 0.096498 0.096615 0.090890 0.076976 0.159186 0.158932 0.159809
qa: -0.4345 0.7622 -0.3184 -0.3385 -0.3396 0.1282 -0.3574 -0.3815 0.1566 0.3431 0.0417 0.0463 0.1003 -0.1829 -0.2001 -0.1294 -0.1302 -0.2344 -0.2383 -0.1655 0.1093 0.0930 0.0887 0.1070 0.1776 0.1400 0.1493 0.0769 0.0917 0.0965 0.0966 0.0909 0.0770 0.1592 0.1589 0.1598
va: 1.9831 5.4854 2.1637 2.1071 2.1137 3.4259 2.8107 3.0466 3.7101 4.2324 3.8537 3.8476 4.0395 3.9651 3.9819 3.9186 3.9086 3.9303 3.9212 3.9126 0.9920 1.0080 1.0111 0.9963 0.9888 1.0262 1.0034 1.0123 1.0058 1.0089 1.0093 1.0030 1.0160 0.9904 0.9907 0.9894
dispcorr: -0.015673019 hartree
energy: -1596.618613099030
dipole: 7.18158 -8.38708 -1.20550 -12.37425 11.57803 -0.79622 -0.18428 0.51618 0.33190
magnitude: 1.48235 au
magnitude: 3.76783 debye
