program: Orca
programVersion: 5.0.2
elementType: S P O O O N N N C C C C C C C C C C C C H H H H H H H H H H H H H H H H
charge: 0
multiplicity: 1
keywords: wb97x-d3
keywords: def2-TZVPP
keywords: def2/J RIJCOSX
keywords: DEFGRID2
keywords: scfconv7
keywords: smallprint printgap noloewdin
keywords: NOSOSCF
formula: C12H16N3O3PS
InChI: InChI=1/C12H16N3O3PS/c1-3-16-19(20,17-4-2)18-12-13-10-15(14-12)11-8-6-5-7-9-11/h5-10H,3-4H2,1-2H3
36 atoms
S  4.033597 -0.705818 -0.45683
P  2.366269 -0.056354 0.197708
O  1.164015 -1.12433 -0.128027
O  2.21313 0.235279 1.752764
O  1.813917 1.327062 -0.357467
N  -2.082783 -0.321429 0.174556
N  -0.95138 -0.285938 -0.541404
N  -0.608483 -1.341512 1.406713
C  -3.280943 0.224531 -0.32399
C  -0.105901 -0.901275 0.240624
C  2.963275 -0.496238 2.734423
C  2.1282 1.797026 -1.675505
C  -1.856739 -0.9638 1.333277
C  -3.449874 0.365901 -1.694764
C  -4.282159 0.617131 0.554349
C  -4.63399 0.893682 -2.181203
C  -5.468082 1.128233 0.052882
C  2.534822 -1.940884 2.860936
C  1.445632 1.008161 -2.770076
C  -5.649024 1.270279 -1.314044
H  4.026772 -0.427007 2.493878
H  2.79112 0.043676 3.664407
H  1.795595 2.834083 -1.680637
H  3.212398 1.786855 -1.810559
H  -2.620186 -1.153619 2.070547
H  -2.659189 0.066353 -2.367436
H  -4.139248 0.551055 1.624811
H  1.462616 -2.027545 3.02747
H  2.793047 -2.516042 1.971921
H  3.056344 -2.392385 3.705832
H  1.830039 -0.009727 -2.833526
H  0.36915 0.962765 -2.614891
H  1.637664 1.49195 -3.728479
H  -4.763363 1.006077 -3.249199
H  -6.246573 1.432232 0.739321
H  -6.572712 1.678456 -1.700794
totalener: -1596.57635736 hartree
nucrepener: 1918.34067971 hartree
electener: -3514.91703707 hartree
oneelecener: -6003.64763231 hartree
twoeener: 2488.73059524 hartree
kineticenergy: 1591.56328222 hartree
xcener: -117.728563209618 hartree
chargesum: -0.0000000
charge: -0.369723 0.669462 -0.292971 -0.308826 -0.306934 0.129642 -0.315646 -0.345191 0.156952 0.354141 0.010064 0.011638 0.076371 -0.167423 -0.188171 -0.092400 -0.107432 -0.238571 -0.241201 -0.136626 0.094378 0.093715 0.094242 0.094407 0.138007 0.137652 0.119754 0.095518 0.089909 0.084354 0.092641 0.090716 0.086967 0.130823 0.129816 0.129948
qa: -0.3697 0.6695 -0.2930 -0.3088 -0.3069 0.1296 -0.3156 -0.3452 0.1570 0.3541 0.0101 0.0116 0.0764 -0.1674 -0.1882 -0.0924 -0.1074 -0.2386 -0.2412 -0.1366 0.0944 0.0937 0.0942 0.0944 0.1380 0.1377 0.1198 0.0955 0.0899 0.0844 0.0926 0.0907 0.0870 0.1308 0.1298 0.1299
va: 2.0745 5.5279 2.1207 2.1279 2.1293 3.4014 2.8511 3.0643 3.8062 4.1677 3.8959 3.8977 4.0708 4.0190 4.0317 3.9521 3.9872 3.8639 3.8783 3.9777 1.0097 0.9923 0.9924 1.0109 0.9982 1.0232 1.0115 1.0257 1.0205 1.0121 1.0198 1.0118 1.0126 0.9997 1.0007 0.9992
dispcorr: -0.016595927 hartree
energy: -1596.592953286274
dipole: -5.70382 3.66741 -2.03642 3.42485 -2.69740 0.72745 -0.75690 1.01494 0.25805
magnitude: 2.17779 au
magnitude: 5.53549 debye
