program: Orca
programVersion: 5.0.2
elementType: S P O O O N N N C C C C C C C C C C C C H H H H H H H H H H H H H H H H
charge: 0
multiplicity: 1
keywords: wb97x-d3
keywords: def2-TZVPP
keywords: def2/J RIJCOSX
keywords: DEFGRID2
keywords: scfconv7
keywords: smallprint printgap noloewdin
keywords: NOSOSCF
formula: C12H16N3O3PS
InChI: InChI=1/C12H16N3O3PS/c1-3-16-19(20,17-4-2)18-12-13-10-15(14-12)11-8-6-5-7-9-11/h5-10H,3-4H2,1-2H3
36 atoms
S  2.527275 -0.782206 -1.547341
P  2.312695 0.11368 0.128576
O  0.858871 0.806547 0.39399
O  2.516318 -0.709191 1.467304
O  3.222845 1.391495 0.391391
N  -2.310607 -0.196282 0.041176
N  -1.399258 0.789746 0.036496
N  -0.419265 -1.18447 0.45704
C  -3.678784 0.073312 -0.15013
C  -0.295599 0.142582 0.289224
C  3.246202 -1.943066 1.518327
C  3.689457 2.229222 -0.674496
C  -1.703286 -1.366078 0.295981
C  -4.530641 -0.930721 -0.592238
C  -4.166994 1.346894 0.109979
C  -5.881094 -0.662773 -0.745995
C  -5.516731 1.603966 -0.06232
C  2.318227 -3.130576 1.429158
C  5.118125 1.887609 -1.025982
C  -6.380456 0.603465 -0.482906
H  3.990596 -1.977391 0.719469
H  3.777514 -1.924385 2.469888
H  3.046635 2.133628 -1.552441
H  3.603658 3.252037 -0.307584
H  -2.223255 -2.306633 0.379902
H  -4.150154 -1.912761 -0.84033
H  -3.491827 2.123134 0.440024
H  1.560037 -3.098819 2.210139
H  1.814023 -3.160542 0.465442
H  2.895275 -4.048503 1.54788
H  5.487896 2.580417 -1.782556
H  5.768555 1.962303 -0.154852
H  5.186985 0.8786 -1.430475
H  -6.541154 -1.447727 -1.089436
H  -5.895082 2.597036 0.139482
H  -7.433982 0.810504 -0.611885
totalener: -1596.57710931 hartree
nucrepener: 1873.71337058 hartree
electener: -3470.29047989 hartree
oneelecener: -5914.61416308 hartree
twoeener: 2444.32368319 hartree
kineticenergy: 1591.56678458 hartree
xcener: -117.730404739259 hartree
chargesum: -0.0000000
charge: -0.395033 0.724190 -0.290660 -0.305427 -0.315512 0.130623 -0.293827 -0.361544 0.148736 0.328101 0.028125 0.024793 0.079170 -0.190815 -0.160055 -0.108070 -0.091848 -0.217072 -0.226062 -0.138395 0.078093 0.093201 0.082602 0.093896 0.137418 0.119027 0.138419 0.082174 0.086395 0.084409 0.079919 0.084887 0.081739 0.128638 0.130462 0.129306
qa: -0.3950 0.7242 -0.2907 -0.3054 -0.3155 0.1306 -0.2938 -0.3615 0.1487 0.3281 0.0281 0.0248 0.0792 -0.1908 -0.1601 -0.1081 -0.0918 -0.2171 -0.2261 -0.1384 0.0781 0.0932 0.0826 0.0939 0.1374 0.1190 0.1384 0.0822 0.0864 0.0844 0.0799 0.0849 0.0817 0.1286 0.1305 0.1293
va: 2.0182 5.5072 2.1870 2.1326 2.1339 3.3898 2.8434 3.0466 3.8214 4.2243 3.8937 3.8979 4.0793 4.0336 4.0126 3.9846 3.9488 3.8946 3.9127 3.9774 1.0157 0.9946 1.0136 0.9954 0.9978 1.0116 1.0326 1.0101 1.0235 1.0117 1.0120 1.0046 1.0241 1.0009 1.0000 0.9994
dispcorr: -0.015077576 hartree
energy: -1596.592186888447
dipole: 5.13285 -6.04313 -0.91027 -2.86846 2.59555 -0.27291 0.64833 -0.36229 0.28603
magnitude: 0.99242 au
magnitude: 2.52253 debye
