program: Orca
programVersion: 5.0.2
elementType: S P O O O N N N C C C C C C C C C C C C H H H H H H H H H H H H H H H H
charge: 0
multiplicity: 1
keywords: wb97x-d3
keywords: def2-TZVPP
keywords: def2/J RIJCOSX
keywords: DEFGRID2
keywords: scfconv7
keywords: smallprint printgap noloewdin
keywords: NOSOSCF
formula: C12H16N3O3PS
InChI: InChI=1/C12H16N3O3PS/c1-3-16-19(20,17-4-2)18-12-13-10-15(14-12)11-8-6-5-7-9-11/h5-10H,3-4H2,1-2H3
36 atoms
S  2.412061 -0.743398 -1.566959
P  2.297468 -0.324874 0.295178
O  0.798478 -0.37794 0.94436
O  3.020849 -1.310342 1.311392
O  2.822764 1.084253 0.795951
N  -2.205847 0.596976 -0.149889
N  -1.449291 -0.277474 0.531558
N  -0.174438 1.343533 -0.353377
C  -3.606201 0.467439 -0.198336
C  -0.253001 0.21724 0.374529
C  3.075576 -2.72451 1.07679
C  3.689999 1.913525 0.006572
C  -1.424326 1.557173 -0.669175
C  -4.262867 -0.221792 0.812236
C  -4.319529 1.031608 -1.247724
C  -5.642833 -0.328656 0.773387
C  -5.701055 0.929407 -1.265689
C  4.437385 -3.118544 0.555331
C  2.907129 2.929588 -0.78974
C  -6.367886 0.25075 -0.257468
H  2.865589 -3.19452 2.03743
H  2.29535 -3.0336 0.377378
H  4.354344 2.396751 0.722723
H  4.302082 1.297667 -0.656083
H  -1.79894 2.392562 -1.238239
H  -3.693043 -0.668237 1.61434
H  -3.808776 1.528103 -2.062179
H  5.22782 -2.808112 1.238074
H  4.492202 -4.202128 0.44714
H  4.622721 -2.672526 -0.420961
H  2.289526 3.551104 -0.14333
H  3.602012 3.576863 -1.326518
H  2.258653 2.442245 -1.514836
H  -6.153937 -0.866535 1.560397
H  -6.25468 1.370389 -2.083423
H  -7.445781 0.166919 -0.279313
totalener: -1596.57736569 hartree
nucrepener: 1876.33950222 hartree
electener: -3472.91686790 hartree
oneelecener: -5919.87327223 hartree
twoeener: 2446.95640432 hartree
kineticenergy: 1591.57089729 hartree
xcener: -117.730434134231 hartree
chargesum: -0.0000000
charge: -0.396643 0.730007 -0.293374 -0.315885 -0.308473 0.130511 -0.292586 -0.361397 0.148771 0.326025 0.022554 0.029213 0.079016 -0.159978 -0.192034 -0.091529 -0.107295 -0.224704 -0.218623 -0.137797 0.093932 0.082329 0.094205 0.078682 0.139131 0.137693 0.120328 0.084560 0.079414 0.082463 0.082690 0.083966 0.086384 0.130118 0.128755 0.129574
qa: -0.3966 0.7300 -0.2934 -0.3159 -0.3085 0.1305 -0.2926 -0.3614 0.1488 0.3260 0.0226 0.0292 0.0790 -0.1600 -0.1920 -0.0915 -0.1073 -0.2247 -0.2186 -0.1378 0.0939 0.0823 0.0942 0.0787 0.1391 0.1377 0.1203 0.0846 0.0794 0.0825 0.0827 0.0840 0.0864 0.1301 0.1288 0.1296
va: 2.0161 5.5037 2.1776 2.1371 2.1359 3.3867 2.8418 3.0457 3.8144 4.2241 3.9067 3.8896 4.0765 4.0155 4.0353 3.9489 3.9841 3.9152 3.8954 3.9770 0.9957 1.0115 0.9942 1.0168 0.9972 1.0321 1.0111 1.0046 1.0117 1.0240 1.0094 1.0114 1.0241 1.0001 1.0009 0.9993
dispcorr: -0.015110095 hartree
energy: -1596.592475780848
dipole: 4.73384 -5.63935 -0.90551 0.79233 -0.32492 0.46741 -1.63224 1.59168 -0.04056
magnitude: 1.01984 au
magnitude: 2.59223 debye
