program: Orca
programVersion: 5.0.2
elementType: S P O O O N N N C C C C C C C C C C C C H H H H H H H H H H H H H H H H
charge: 0
multiplicity: 1
keywords: wb97x-d3
keywords: def2-TZVPP
keywords: def2/J RIJCOSX
keywords: DEFGRID2
keywords: scfconv7
keywords: smallprint printgap noloewdin
keywords: NOSOSCF
formula: C12H16N3O3PS
InChI: InChI=1/C12H16N3O3PS/c1-3-16-19(20,17-4-2)18-12-13-10-15(14-12)11-8-6-5-7-9-11/h5-10H,3-4H2,1-2H3
36 atoms
S  2.499589 -1.615208 -1.253339
P  2.285368 -0.543502 0.31233
O  0.769991 -0.388468 0.903074
O  2.889234 -1.07087 1.682833
O  2.84872 0.943019 0.234822
N  -2.14179 0.514908 -0.46778
N  -1.466447 -0.17079 0.469027
N  -0.048349 0.914674 -0.888528
C  -3.54963 0.530965 -0.485538
C  -0.227726 0.103521 0.16959
C  4.192015 -1.667944 1.717773
C  3.077344 1.655653 -0.988958
C  -1.276778 1.156852 -1.266645
C  -4.226524 0.814297 -1.664405
C  -4.250058 0.265569 0.68341
C  -5.611127 0.86016 -1.662443
C  -5.634168 0.30039 0.666806
C  4.081451 -3.168926 1.839285
C  2.739872 3.109024 -0.765371
C  -6.320659 0.603958 -0.499652
H  4.770296 -1.400598 0.829229
H  4.696372 -1.233997 2.581262
H  4.128062 1.529622 -1.258265
H  2.472063 1.237292 -1.792404
H  -1.57316 1.797632 -2.081193
H  -3.688479 0.976408 -2.589005
H  -3.711194 0.03048 1.589952
H  3.502825 -3.452244 2.717763
H  3.606684 -3.594892 0.956391
H  5.076414 -3.605105 1.935075
H  3.330606 3.542057 0.041328
H  2.947754 3.675003 -1.673838
H  1.68391 3.22594 -0.527002
H  -6.135429 1.081831 -2.58206
H  -6.178456 0.091146 1.577784
H  -7.401656 0.632901 -0.504641
totalener: -1596.57771876 hartree
nucrepener: 1872.47414991 hartree
electener: -3469.05186867 hartree
oneelecener: -5912.00177330 hartree
twoeener: 2442.94990463 hartree
kineticenergy: 1591.56994011 hartree
xcener: -117.730709403015 hartree
chargesum: -0.0000000
charge: -0.390069 0.709608 -0.279940 -0.305574 -0.320631 0.132501 -0.293955 -0.388937 0.149937 0.345394 0.017652 0.040071 0.079897 -0.192113 -0.159798 -0.107263 -0.091367 -0.216833 -0.230535 -0.138528 0.075057 0.092630 0.100578 0.095965 0.140001 0.119057 0.139206 0.086336 0.085123 0.076715 0.085207 0.073497 0.080712 0.129029 0.131081 0.130291
qa: -0.3901 0.7096 -0.2799 -0.3056 -0.3206 0.1325 -0.2940 -0.3889 0.1499 0.3454 0.0177 0.0401 0.0799 -0.1921 -0.1598 -0.1073 -0.0914 -0.2168 -0.2305 -0.1385 0.0751 0.0926 0.1006 0.0960 0.1400 0.1191 0.1392 0.0863 0.0851 0.0767 0.0852 0.0735 0.0807 0.1290 0.1311 0.1303
va: 2.0301 5.5322 2.1946 2.1424 2.1075 3.3870 2.8390 3.0263 3.8163 4.1931 3.9251 3.8244 4.0758 4.0354 4.0144 3.9841 3.9491 3.9186 3.9413 3.9778 1.0087 0.9947 0.9991 1.0198 0.9977 1.0117 1.0322 1.0059 1.0223 1.0107 1.0063 1.0087 1.0166 1.0008 0.9999 0.9991
dispcorr: -0.015066527 hartree
energy: -1596.592785285754
dipole: 4.69998 -5.45476 -0.75478 4.77875 -3.73293 1.04582 0.22287 -0.54503 -0.32216
magnitude: 1.32937 au
magnitude: 3.37899 debye
