program: Orca
programVersion: 5.0.2
elementType: S P O O O N N N C C C C C C C C C C C C H H H H H H H H H H H H H H H H
charge: 0
multiplicity: 1
keywords: wb97x-d3
keywords: def2-TZVPP
keywords: def2/J RIJCOSX
keywords: DEFGRID2
keywords: scfconv7
keywords: smallprint printgap noloewdin
keywords: NOSOSCF
formula: C12H16N3O3PS
InChI: InChI=1/C12H16N3O3PS/c1-3-16-19(20,17-4-2)18-12-13-10-15(14-12)11-8-6-5-7-9-11/h5-10H,3-4H2,1-2H3
36 atoms
S  1.492034 -1.972721 1.165811
P  2.015695 -0.21972 0.613995
O  1.168711 1.032635 1.235897
O  3.433328 0.320814 1.082605
O  2.015179 0.074209 -0.952245
N  -2.055971 1.031735 0.280596
N  -0.80938 0.565359 0.099116
N  -0.849835 2.03188 1.795629
C  -3.116058 0.619565 -0.547166
C  -0.13938 1.189482 1.029898
C  4.477607 -0.548623 1.531842
C  1.360805 -0.7655 -1.912265
C  -2.050144 1.914107 1.293943
C  -2.836545 0.014602 -1.765541
C  -4.432717 0.815305 -0.14824
C  -3.879755 -0.383757 -2.584092
C  -5.466021 0.424196 -0.983477
C  5.173109 -1.252089 0.388599
C  2.335155 -1.742534 -2.527967
C  -5.197048 -0.177401 -2.203113
H  5.167689 0.101365 2.068108
H  4.0735 -1.273442 2.242027
H  0.52564 -1.291991 -1.448811
H  0.954966 -0.085708 -2.661973
H  -2.923004 2.454581 1.622644
H  -1.810347 -0.141158 -2.064182
H  -4.665656 1.250031 0.814603
H  6.029293 -1.808542 0.770925
H  4.51022 -1.965504 -0.100491
H  5.534824 -0.543231 -0.355285
H  2.694316 -2.453878 -1.784865
H  1.838195 -2.309103 -3.316137
H  3.19045 -1.23148 -2.96909
H  -3.657168 -0.85775 -3.530643
H  -6.488668 0.580844 -0.668041
H  -6.007526 -0.488059 -2.847944
totalener: -1596.57616626 hartree
nucrepener: 1915.27952561 hartree
electener: -3511.85569186 hartree
oneelecener: -5997.32351635 hartree
twoeener: 2485.46782449 hartree
kineticenergy: 1591.55910941 hartree
xcener: -117.732086841407 hartree
chargesum: -0.0000000
charge: -0.385564 0.702531 -0.281084 -0.308032 -0.314039 0.095771 -0.331897 -0.309498 0.153799 0.338185 0.023413 0.055411 0.075067 -0.143289 -0.174481 -0.114862 -0.116929 -0.236506 -0.244173 -0.130219 0.096389 0.091484 0.086963 0.091588 0.136542 0.128181 0.116088 0.087713 0.078547 0.091121 0.079037 0.085593 0.090804 0.127288 0.129126 0.129930
qa: -0.3856 0.7025 -0.2811 -0.3080 -0.3140 0.0958 -0.3319 -0.3095 0.1538 0.3382 0.0234 0.0554 0.0751 -0.1433 -0.1745 -0.1149 -0.1169 -0.2365 -0.2442 -0.1302 0.0964 0.0915 0.0870 0.0916 0.1365 0.1282 0.1161 0.0877 0.0785 0.0911 0.0790 0.0856 0.0908 0.1273 0.1291 0.1299
va: 2.0326 5.5258 2.2106 2.1425 2.1009 3.4819 2.8524 3.0737 3.8401 4.2231 3.8878 3.8525 4.0722 4.0057 4.0157 3.9849 3.9950 3.8920 3.9297 3.9684 0.9931 1.0146 1.0107 0.9906 1.0004 1.0218 1.0130 1.0126 1.0155 1.0063 1.0160 1.0148 1.0021 1.0007 1.0009 0.9990
dispcorr: -0.016486212 hartree
energy: -1596.592652470209
dipole: 6.29629 -7.12456 -0.82826 -8.91004 8.77590 -0.13414 -13.59054 12.37667 -1.21387
magnitude: 1.47563 au
magnitude: 3.75076 debye
