program: Orca
programVersion: 5.0.2
elementType: S S S P O O C C C C C C H H H H H H H H H H H H H H H
charge: 0
multiplicity: 1
keywords: wb97x-d3
keywords: def2-TZVPP
keywords: def2/J RIJCOSX
keywords: DEFGRID2
keywords: scfconv7
keywords: smallprint printgap noloewdin
keywords: NOSOSCF
formula: C6H15O2PS3
InChI: InChI=1/C6H15O2PS3/c1-4-11-5-6-12-9(10,7-2)8-3/h4-6H2,1-3H3
27 atoms
S  -0.189591 1.008461 -0.789538
S  2.529974 -0.160169 0.976818
S  -1.934351 -1.901229 -1.114768
P  -1.644466 -0.303119 -0.087982
O  -1.292507 -0.653207 1.43011
O  -2.891136 0.690119 0.092502
C  1.05868 -0.152982 -1.430108
C  1.731633 -1.027181 -0.389906
C  3.874781 0.687532 0.097473
C  4.878013 1.231724 1.097284
C  -0.985256 0.352163 2.406344
C  -3.620364 1.169036 -1.043012
H  1.783994 0.486561 -1.934074
H  0.59045 -0.775691 -2.192131
H  2.472744 -1.64585 -0.902615
H  1.016021 -1.715662 0.061083
H  4.354028 -0.027838 -0.573391
H  3.470127 1.49734 -0.511022
H  5.311921 0.435245 1.701642
H  5.690701 1.732293 0.570083
H  4.424338 1.959976 1.770004
H  -0.148365 0.971148 2.082929
H  -0.704206 -0.177543 3.312895
H  -1.851681 0.979058 2.613009
H  -4.55538 1.577046 -0.667868
H  -3.837397 0.362079 -1.743449
H  -3.066053 1.955144 -1.555987
elementType: S P O C H
totalener: -1924.22771575 hartree
nucrepener: 1280.17855031 hartree
electener: -3204.40626605 hartree
oneelecener: -5200.09067122 hartree
twoeener: 1995.68440517 hartree
cpcmener: -0.02050720 hartree
kineticenergy: 1919.64372728 hartree
xcener: -112.330506044071 hartree
chargesum: 0.0000000
charge: -0.173303 -0.162087 -0.448688 0.654379 -0.345786 -0.357260 -0.117486 -0.135746 -0.107632 -0.255934 -0.118831 -0.105894 0.139987 0.132434 0.125098 0.103009 0.097925 0.092464 0.085568 0.094618 0.088650 0.095576 0.132895 0.133739 0.129820 0.106638 0.115844
qa: -0.1733 -0.1621 -0.4487 0.6544 -0.3458 -0.3573 -0.1175 -0.1357 -0.1076 -0.2559 -0.1188 -0.1059 0.1400 0.1324 0.1251 0.1030 0.0979 0.0925 0.0856 0.0946 0.0887 0.0956 0.1329 0.1337 0.1298 0.1066 0.1158
va: 2.2850 2.2006 2.0211 5.4174 2.0697 2.0780 3.8458 3.9594 3.9884 3.9243 3.8230 3.8522 0.9941 1.0262 1.0082 1.0280 0.9998 0.9994 1.0106 1.0024 1.0046 1.0192 0.9871 0.9945 0.9907 1.0023 0.9914
dispcorr: -0.011580387 hartree
energy: -1924.239296135122
dipole: 15.76646 -14.66737 1.09909 7.85640 -6.09488 1.76151 1.88372 -2.38736 -0.50365
magnitude: 2.13649 au
magnitude: 5.43053 debye
