program: Orca
programVersion: 5.0.2
elementType: S S S P O O C C C C C C H H H H H H H H H H H H H H H
charge: 0
multiplicity: 1
keywords: wb97x-d3
keywords: def2-TZVPP
keywords: def2/J RIJCOSX
keywords: DEFGRID2
keywords: scfconv7
keywords: smallprint printgap noloewdin
keywords: NOSOSCF
formula: C6H15O2PS3
InChI: InChI=1/C6H15O2PS3/c1-4-11-5-6-12-9(10,7-2)8-3/h4-6H2,1-3H3
27 atoms
S  -0.271694 1.316675 0.458716
S  3.162835 -1.204339 -0.80527
S  -1.369988 -1.797672 1.31587
P  -1.741542 -0.163571 0.375816
O  -3.028196 0.680019 0.830673
O  -2.077154 -0.441206 -1.160679
C  1.261756 0.321212 0.494547
C  1.556226 -0.356022 -0.829438
C  4.22876 0.01189 -1.634806
C  4.396009 1.326945 -0.901519
C  -3.208714 1.044745 2.203417
C  -2.44125 0.605313 -2.070402
H  1.185293 -0.399218 1.308396
H  2.036691 1.040745 0.757322
H  1.546984 0.359394 -1.652895
H  0.800337 -1.111123 -1.047306
H  5.191395 -0.492227 -1.736851
H  3.84959 0.175816 -2.644774
H  4.770422 1.175003 0.110422
H  5.109667 1.958655 -1.433721
H  3.458735 1.880254 -0.841094
H  -4.216277 1.44122 2.293948
H  -2.493137 1.811017 2.502372
H  -3.103551 0.179228 2.85817
H  -1.775971 1.465097 -1.981934
H  -3.470236 0.920767 -1.904965
H  -2.348829 0.19299 -3.071494
elementType: S P O C H
totalener: -1924.22807855 hartree
nucrepener: 1251.20445755 hartree
electener: -3175.43253610 hartree
oneelecener: -5141.80184791 hartree
twoeener: 1966.36931181 hartree
cpcmener: -0.02162174 hartree
kineticenergy: 1919.62803301 hartree
xcener: -112.323495749717 hartree
chargesum: -0.0000000
charge: -0.186276 -0.184310 -0.444488 0.649442 -0.352613 -0.344946 -0.108567 -0.130034 -0.099559 -0.258047 -0.106648 -0.112848 0.122868 0.137650 0.115564 0.117094 0.105602 0.094488 0.082219 0.100951 0.083557 0.129998 0.114392 0.108560 0.110121 0.126806 0.129022
qa: -0.1863 -0.1843 -0.4445 0.6494 -0.3526 -0.3449 -0.1086 -0.1300 -0.0996 -0.2580 -0.1066 -0.1128 0.1229 0.1377 0.1156 0.1171 0.1056 0.0945 0.0822 0.1010 0.0836 0.1300 0.1144 0.1086 0.1101 0.1268 0.1290
va: 2.2787 2.1654 2.0250 5.4145 2.0762 2.0761 3.8559 3.9032 3.9686 3.9035 3.8516 3.8387 1.0349 1.0064 1.0159 1.0313 1.0005 1.0101 1.0127 1.0051 0.9992 0.9908 0.9934 1.0008 1.0022 0.9926 0.9882
dispcorr: -0.011306912 hartree
energy: -1924.239385462940
dipole: 11.68029 -11.51572 0.16457 10.62637 -8.00028 2.62609 -6.34636 5.48678 -0.85958
magnitude: 2.76809 au
magnitude: 7.03592 debye
