program: Orca
programVersion: 5.0.2
elementType: S S S P O O C C C C C C H H H H H H H H H H H H H H H
charge: 0
multiplicity: 1
keywords: wb97x-d3
keywords: def2-TZVPP
keywords: def2/J RIJCOSX
keywords: DEFGRID2
keywords: scfconv7
keywords: smallprint printgap noloewdin
keywords: NOSOSCF
formula: C6H15O2PS3
InChI: InChI=1/C6H15O2PS3/c1-4-11-5-6-12-9(10,7-2)8-3/h4-6H2,1-3H3
27 atoms
S  -0.748588 1.632797 -0.456527
S  3.540408 0.571631 -0.956015
S  -0.682052 -1.777871 0.021525
P  -1.574016 -0.096251 0.3367
O  -1.778442 0.297156 1.874342
O  -3.075105 0.019314 -0.219753
C  1.039307 1.40127 -0.109308
C  1.751739 0.693924 -1.244983
C  3.696385 -1.056321 -0.163667
C  3.12977 -1.155282 1.238856
C  -2.167846 -0.696568 2.833797
C  -3.411096 -0.457338 -1.526731
H  1.154723 0.887632 0.842971
H  1.425131 2.412053 0.021331
H  1.620689 1.253529 -2.171867
H  1.346786 -0.305307 -1.407088
H  3.250643 -1.806702 -0.818832
H  4.770855 -1.248029 -0.152299
H  3.540357 -0.384014 1.889998
H  2.043375 -1.070084 1.243822
H  3.378776 -2.127073 1.669824
H  -2.208787 -0.193645 3.796283
H  -1.437091 -1.503424 2.879869
H  -3.150197 -1.10783 2.60166
H  -2.907101 0.123017 -2.300782
H  -4.485806 -0.337849 -1.635284
H  -3.152578 -1.510121 -1.640288
elementType: S P O C H
totalener: -1924.22652828 hartree
nucrepener: 1266.05825344 hartree
electener: -3190.28478172 hartree
oneelecener: -5171.63949725 hartree
twoeener: 1981.35471553 hartree
cpcmener: -0.01718426 hartree
kineticenergy: 1919.62654874 hartree
xcener: -112.322693707621 hartree
chargesum: -0.0000000
charge: -0.169720 -0.185664 -0.461302 0.683895 -0.351420 -0.361079 -0.102832 -0.129145 -0.102049 -0.243117 -0.118890 -0.105903 0.121230 0.132893 0.124753 0.103480 0.093759 0.108300 0.083786 0.054141 0.100489 0.131007 0.111641 0.127456 0.113000 0.129898 0.111395
qa: -0.1697 -0.1857 -0.4613 0.6839 -0.3514 -0.3611 -0.1028 -0.1291 -0.1020 -0.2431 -0.1189 -0.1059 0.1212 0.1329 0.1248 0.1035 0.0938 0.1083 0.0838 0.0541 0.1005 0.1310 0.1116 0.1275 0.1130 0.1299 0.1114
va: 2.2913 2.1672 1.9832 5.3711 2.0781 2.0776 3.8681 3.9248 3.9643 3.8783 3.8440 3.8472 1.0213 1.0146 1.0122 1.0376 1.0103 1.0008 1.0164 1.0334 1.0063 0.9898 1.0006 0.9882 0.9918 0.9911 1.0029
dispcorr: -0.011887075 hartree
energy: -1924.238415357648
dipole: 6.41045 -7.16341 -0.75295 -6.06699 5.76627 -0.30073 3.77872 -3.40136 0.37737
magnitude: 0.89431 au
magnitude: 2.27315 debye
