program: Orca
programVersion: 5.0.2
elementType: S S S P O O C C C C C C H H H H H H H H H H H H H H H
charge: 0
multiplicity: 1
keywords: wb97x-d3
keywords: def2-TZVPP
keywords: def2/J RIJCOSX
keywords: DEFGRID2
keywords: scfconv7
keywords: smallprint printgap noloewdin
keywords: NOSOSCF
formula: C6H15O2PS3
InChI: InChI=1/C6H15O2PS3/c1-4-11-5-6-12-9(10,7-2)8-3/h4-6H2,1-3H3
27 atoms
S  -0.692271 1.785082 -0.251687
S  3.399967 0.401947 -1.243154
S  -0.24403 -1.329389 1.120389
P  -1.482759 0.035117 0.556735
O  -2.43334 0.652739 1.684518
O  -2.580558 -0.437759 -0.517036
C  1.111057 1.488862 -0.170287
C  1.612667 0.68769 -1.353631
C  3.454741 -0.968682 -0.049093
C  3.024821 -2.300663 -0.628903
C  -3.236947 -0.211547 2.501456
C  -2.173481 -1.101432 -1.714472
H  1.339884 1.0139 0.78217
H  1.550014 2.486445 -0.160739
H  1.44123 1.233666 -2.28198
H  1.091755 -0.266829 -1.437607
H  4.491922 -1.012958 0.286614
H  2.854254 -0.708669 0.823652
H  1.995439 -2.273644 -0.986272
H  3.666483 -2.597222 -1.458186
H  3.08122 -3.077794 0.135779
H  -4.051158 -0.649761 1.925339
H  -3.650056 0.406103 3.294196
H  -2.635244 -1.005634 2.944243
H  -1.620668 -2.014509 -1.492018
H  -1.557191 -0.448874 -2.335986
H  -3.080323 -1.354911 -2.257354
elementType: S P O C H
totalener: -1924.22791572 hartree
nucrepener: 1274.50228462 hartree
electener: -3198.73020034 hartree
oneelecener: -5188.38120965 hartree
twoeener: 1989.65100931 hartree
cpcmener: -0.01735584 hartree
kineticenergy: 1919.63811226 hartree
xcener: -112.325915545926 hartree
chargesum: 0.0000000
charge: -0.172679 -0.185252 -0.458077 0.665396 -0.355832 -0.344963 -0.079743 -0.132081 -0.102760 -0.255930 -0.117806 -0.105726 0.113375 0.132142 0.128572 0.092629 0.114133 0.090209 0.074243 0.087622 0.096823 0.125656 0.129768 0.106280 0.111282 0.108223 0.134495
qa: -0.1727 -0.1853 -0.4581 0.6654 -0.3558 -0.3450 -0.0797 -0.1321 -0.1028 -0.2559 -0.1178 -0.1057 0.1134 0.1321 0.1286 0.0926 0.1141 0.0902 0.0742 0.0876 0.0968 0.1257 0.1298 0.1063 0.1113 0.1082 0.1345
va: 2.2925 2.1654 1.9970 5.3820 2.1063 2.0626 3.8083 3.9671 3.9231 3.9038 3.8556 3.8450 1.0370 1.0180 1.0124 1.0245 1.0037 1.0157 1.0088 1.0157 1.0033 0.9902 0.9883 0.9995 1.0006 0.9909 0.9916
dispcorr: -0.012333571 hartree
energy: -1924.240249296033
dipole: 5.61426 -6.44312 -0.82887 -9.30386 8.85302 -0.45084 -2.80003 2.57274 -0.22729
magnitude: 0.97053 au
magnitude: 2.46690 debye
