program: Orca
programVersion: 5.0.2
elementType: S S S P O O C C C C C C H H H H H H H H H H H H H H H
charge: 0
multiplicity: 1
keywords: wb97x-d3
keywords: def2-TZVPP
keywords: def2/J RIJCOSX
keywords: DEFGRID2
keywords: scfconv7
keywords: smallprint printgap noloewdin
keywords: NOSOSCF
formula: C6H15O2PS3
InChI: InChI=1/C6H15O2PS3/c1-4-11-5-6-12-9(10,7-2)8-3/h4-6H2,1-3H3
27 atoms
S  -0.718356 1.755284 -0.158698
S  3.528829 0.620659 -0.728445
S  -0.470318 -1.616067 0.431303
P  -1.611909 -0.105301 0.071656
O  -2.729535 0.217165 1.177977
O  -2.516043 -0.211767 -1.245131
C  0.870101 1.295554 -0.954324
C  1.972513 1.107047 0.06709
C  3.240557 -1.160118 -0.964081
C  3.394113 -1.971328 0.30658
C  -2.382915 0.259385 2.565812
C  -3.17991 -1.44204 -1.568629
H  1.098896 2.118119 -1.630771
H  0.714489 0.405652 -1.562651
H  1.694795 0.362726 0.813475
H  2.167212 2.042198 0.593205
H  2.253868 -1.305045 -1.406579
H  3.969317 -1.476128 -1.711981
H  4.412163 -1.914292 0.690973
H  2.716073 -1.630537 1.089072
H  3.165202 -3.020908 0.112362
H  -1.615968 1.010244 2.762102
H  -2.03241 -0.712753 2.911662
H  -3.287138 0.52912 3.105246
H  -2.462426 -2.252332 -1.696213
H  -3.700268 -1.27325 -2.507647
H  -3.904373 -1.716187 -0.801811
elementType: S P O C H
totalener: -1924.22803408 hartree
nucrepener: 1267.95029654 hartree
electener: -3192.17833062 hartree
oneelecener: -5175.40253538 hartree
twoeener: 1983.22420476 hartree
cpcmener: -0.01722143 hartree
kineticenergy: 1919.62897210 hartree
xcener: -112.323509831281 hartree
chargesum: -0.0000000
charge: -0.171306 -0.186503 -0.462386 0.677720 -0.356299 -0.353195 -0.087233 -0.130825 -0.095766 -0.260506 -0.105341 -0.120826 0.130765 0.112400 0.097581 0.127705 0.087527 0.111781 0.088688 0.078053 0.095683 0.109918 0.113100 0.130747 0.111824 0.130533 0.126161
qa: -0.1713 -0.1865 -0.4624 0.6777 -0.3563 -0.3532 -0.0872 -0.1308 -0.0958 -0.2605 -0.1053 -0.1208 0.1308 0.1124 0.0976 0.1277 0.0875 0.1118 0.0887 0.0781 0.0957 0.1099 0.1131 0.1307 0.1118 0.1305 0.1262
va: 2.2873 2.1587 1.9897 5.3776 2.0731 2.0849 3.8319 3.9448 3.9132 3.9113 3.8456 3.8488 1.0183 1.0300 1.0317 1.0121 1.0213 1.0053 1.0143 1.0040 1.0034 0.9942 1.0013 0.9916 1.0006 0.9897 0.9880
dispcorr: -0.011774733 hartree
energy: -1924.239808813346
dipole: 6.51393 -7.37733 -0.86340 -7.64637 7.35567 -0.29070 1.68857 -1.50954 0.17903
magnitude: 0.92845 au
magnitude: 2.35994 debye
