program: Orca
programVersion: 5.0.2
elementType: S S S P O O C C C C C C H H H H H H H H H H H H H H H
charge: 0
multiplicity: 1
keywords: wb97x-d3
keywords: def2-TZVPP
keywords: def2/J RIJCOSX
keywords: DEFGRID2
keywords: scfconv7
keywords: smallprint printgap noloewdin
keywords: NOSOSCF
formula: C6H15O2PS3
InChI: InChI=1/C6H15O2PS3/c1-4-11-5-6-12-9(10,7-2)8-3/h4-6H2,1-3H3
27 atoms
S  -0.855596 1.463107 -1.023536
S  3.409814 0.648254 -0.101753
S  -0.876197 -1.795261 -0.004555
P  -1.660874 -0.043117 0.16099
O  -1.640472 0.599824 1.626745
O  -3.222314 0.078625 -0.19194
C  0.887579 0.93029 -1.17066
C  1.68959 1.186403 0.089305
C  3.231948 -1.137689 0.193808
C  4.541162 -1.838569 -0.114313
C  -2.003712 -0.195252 2.76557
C  -3.744582 -0.519117 -1.382055
H  1.280595 1.512728 -2.00378
H  0.895081 -0.119486 -1.462447
H  1.256568 0.682292 0.954976
H  1.713304 2.253009 0.314403
H  2.94461 -1.297685 1.233753
H  2.433786 -1.53371 -0.434832
H  4.451379 -2.903723 0.099647
H  4.813292 -1.731104 -1.164032
H  5.360903 -1.449254 0.489791
H  -1.894646 0.445775 3.635889
H  -1.343916 -1.056176 2.867376
H  -3.036977 -0.535385 2.698338
H  -4.812183 -0.317485 -1.390715
H  -3.581342 -1.596515 -1.385218
H  -3.29279 -0.083816 -2.274412
elementType: S P O C H
totalener: -1924.22887283 hartree
nucrepener: 1257.14738650 hartree
electener: -3181.37625933 hartree
oneelecener: -5153.80453342 hartree
twoeener: 1972.42827409 hartree
cpcmener: -0.01702481 hartree
kineticenergy: 1919.62867779 hartree
xcener: -112.323026863631 hartree
chargesum: 0.0000000
charge: -0.165235 -0.179884 -0.461095 0.666802 -0.351552 -0.360155 -0.103654 -0.108815 -0.107650 -0.257271 -0.117099 -0.105902 0.131423 0.118472 0.095612 0.125835 0.097656 0.087873 0.094645 0.087410 0.088860 0.131281 0.110905 0.127937 0.130836 0.112526 0.110240
qa: -0.1652 -0.1799 -0.4611 0.6668 -0.3516 -0.3602 -0.1037 -0.1088 -0.1077 -0.2573 -0.1171 -0.1059 0.1314 0.1185 0.0956 0.1258 0.0977 0.0879 0.0946 0.0874 0.0889 0.1313 0.1109 0.1279 0.1308 0.1125 0.1102
va: 2.3082 2.1836 1.9939 5.3826 2.0669 2.0795 3.8572 3.9349 3.9912 3.9328 3.8405 3.8452 1.0143 1.0342 1.0310 1.0128 1.0018 1.0017 1.0025 1.0082 1.0057 0.9898 1.0014 0.9897 0.9912 1.0018 0.9947
dispcorr: -0.011108879 hartree
energy: -1924.239981711718
dipole: 8.79536 -9.65712 -0.86176 -6.83799 6.57869 -0.25931 2.03406 -1.86828 0.16577
magnitude: 0.91507 au
magnitude: 2.32592 debye
