program: Orca
programVersion: 5.0.2
elementType: S S S P O O C C C C C C H H H H H H H H H H H H H H H
charge: 0
multiplicity: 1
keywords: wb97x-d3
keywords: def2-TZVPP
keywords: def2/J RIJCOSX
keywords: DEFGRID2
keywords: scfconv7
keywords: smallprint printgap noloewdin
keywords: NOSOSCF
formula: C6H15O2PS3
InChI: InChI=1/C6H15O2PS3/c1-4-11-5-6-12-9(10,7-2)8-3/h4-6H2,1-3H3
27 atoms
S  -0.452934 1.437466 -0.723148
S  3.221709 -0.780027 0.402405
S  -1.300591 -1.83379 -0.153225
P  -1.871174 0.00761 -0.187404
O  -2.518136 0.552198 1.178654
O  -3.02415 0.393038 -1.224453
C  1.080431 0.449123 -0.822183
C  1.703525 0.197759 0.534874
C  4.383168 0.467215 -0.229155
C  5.731224 -0.182878 -0.475269
C  -1.827174 0.38666 2.41797
C  -4.295667 -0.271595 -1.175651
H  1.734682 1.047085 -1.45703
H  0.866532 -0.481795 -1.344389
H  1.025448 -0.381444 1.162962
H  1.913695 1.134729 1.053235
H  3.998112 0.89518 -1.155124
H  4.470644 1.273504 0.500648
H  6.140256 -0.619843 0.435962
H  5.664133 -0.968797 -1.227624
H  6.442199 0.561111 -0.834453
H  -2.426198 0.879158 3.179415
H  -0.841015 0.854336 2.388422
H  -1.71941 -0.668123 2.670223
H  -4.888457 0.084316 -0.33406
H  -4.174793 -1.353029 -1.105223
H  -4.807857 -0.031616 -2.103335
elementType: S P O C H
totalener: -1924.22777942 hartree
nucrepener: 1239.08044194 hartree
electener: -3163.30822136 hartree
oneelecener: -5117.67621973 hartree
twoeener: 1954.36799838 hartree
cpcmener: -0.02044691 hartree
kineticenergy: 1919.63815494 hartree
xcener: -112.325005449564 hartree
chargesum: 0.0000000
charge: -0.169950 -0.172132 -0.454376 0.651057 -0.342303 -0.354957 -0.082719 -0.138682 -0.116996 -0.252956 -0.108035 -0.112696 0.140194 0.107847 0.112430 0.114553 0.096663 0.096789 0.087398 0.087253 0.094518 0.133933 0.110480 0.114453 0.124949 0.104378 0.128908
qa: -0.1699 -0.1721 -0.4544 0.6511 -0.3423 -0.3550 -0.0827 -0.1387 -0.1170 -0.2530 -0.1080 -0.1127 0.1402 0.1078 0.1124 0.1146 0.0967 0.0968 0.0874 0.0873 0.0945 0.1339 0.1105 0.1145 0.1249 0.1044 0.1289
va: 2.2962 2.1955 1.9999 5.3937 2.0588 2.1087 3.8101 3.9681 4.0076 3.9147 3.8461 3.8512 1.0059 1.0499 1.0218 1.0156 0.9984 1.0004 1.0072 1.0080 1.0028 0.9921 0.9867 1.0008 0.9914 1.0015 0.9884
dispcorr: -0.010747905 hartree
energy: -1924.238527321055
dipole: 14.36599 -14.29371 0.07229 2.53041 -1.13679 1.39362 2.79610 -2.32246 0.47363
magnitude: 1.47368 au
magnitude: 3.74579 debye
