program: Orca
programVersion: 5.0.2
elementType: S S S P O O C C C C C C H H H H H H H H H H H H H H H
charge: 0
multiplicity: 1
keywords: wb97x-d3
keywords: def2-TZVPP
keywords: def2/J RIJCOSX
keywords: DEFGRID2
keywords: scfconv7
keywords: smallprint printgap noloewdin
keywords: NOSOSCF
formula: C6H15O2PS3
InChI: InChI=1/C6H15O2PS3/c1-4-11-5-6-12-9(10,7-2)8-3/h4-6H2,1-3H3
27 atoms
S  -0.398353 1.377026 0.536007
S  3.117618 -0.874202 -0.957662
S  -1.232341 -1.945351 0.509249
P  -1.857783 -0.127457 0.525076
O  -2.79497 0.171732 1.781861
O  -2.824452 0.313956 -0.677911
C  1.163834 0.425932 0.492261
C  1.545802 0.025618 -0.918088
C  4.296354 0.491618 -0.728963
C  5.708747 -0.059993 -0.677158
C  -3.423727 1.442957 1.992296
C  -2.367899 0.222477 -2.029933
H  1.072149 -0.439284 1.146502
H  1.896926 1.103926 0.930383
H  1.608029 0.896561 -1.572586
H  0.797737 -0.649406 -1.335737
H  4.188241 1.195652 -1.55548
H  4.068664 1.023887 0.195013
H  5.971222 -0.584275 -1.596322
H  6.420038 0.755654 -0.545972
H  5.838438 -0.750279 0.156519
H  -4.180044 1.641034 1.234113
H  -2.694361 2.254589 2.002704
H  -3.900721 1.393131 2.967356
H  -2.143669 -0.809923 -2.299638
H  -1.481521 0.839046 -2.190781
H  -3.173492 0.590082 -2.660718
elementType: S P O C H
totalener: -1924.22721127 hartree
nucrepener: 1239.41302043 hartree
electener: -3163.64023171 hartree
oneelecener: -5118.21136753 hartree
twoeener: 1954.57113583 hartree
cpcmener: -0.02258497 hartree
kineticenergy: 1919.62259151 hartree
xcener: -112.322956851749 hartree
chargesum: 0.0000000
charge: -0.200102 -0.173238 -0.438142 0.644214 -0.352068 -0.339248 -0.076364 -0.132137 -0.118030 -0.253050 -0.114232 -0.107165 0.108645 0.139668 0.113755 0.112583 0.097347 0.096565 0.087641 0.094907 0.086988 0.125065 0.110946 0.128525 0.113021 0.110001 0.133905
qa: -0.2001 -0.1732 -0.4381 0.6442 -0.3521 -0.3392 -0.0764 -0.1321 -0.1180 -0.2530 -0.1142 -0.1072 0.1086 0.1397 0.1138 0.1126 0.0973 0.0966 0.0876 0.0949 0.0870 0.1251 0.1109 0.1285 0.1130 0.1100 0.1339
va: 2.2778 2.1959 2.0179 5.4160 2.1125 2.0586 3.8160 3.9626 4.0075 3.9147 3.8565 3.8425 1.0480 1.0049 1.0160 1.0253 1.0003 0.9982 1.0072 1.0024 1.0079 0.9918 0.9915 0.9882 0.9980 0.9941 0.9920
dispcorr: -0.010707575 hartree
energy: -1924.237918848851
dipole: 15.05644 -14.80362 0.25282 8.27517 -5.59451 2.68066 -5.74860 5.11456 -0.63404
magnitude: 2.76620 au
magnitude: 7.03111 debye
