program: Orca
programVersion: 5.0.2
elementType: S S S P O O C C C C C C H H H H H H H H H H H H H H H
charge: 0
multiplicity: 1
keywords: wb97x-d3
keywords: def2-TZVPP
keywords: def2/J RIJCOSX
keywords: DEFGRID2
keywords: scfconv7
keywords: smallprint printgap noloewdin
keywords: NOSOSCF
formula: C6H15O2PS3
InChI: InChI=1/C6H15O2PS3/c1-4-11-5-6-12-9(10,7-2)8-3/h4-6H2,1-3H3
27 atoms
S  -0.800615 1.535437 -0.337129
S  3.55686 0.728693 -0.745588
S  -0.621654 -1.883828 -0.470654
P  -1.543492 -0.335851 0.205885
O  -1.632609 -0.366854 1.799403
O  -3.082811 -0.1668 -0.208309
C  0.980146 1.333852 0.069697
C  1.782047 0.842595 -1.11954
C  3.742885 -1.011884 -0.255079
C  3.135945 -1.378022 1.084749
C  -2.372405 0.607506 2.547555
C  -3.506659 -0.303631 -1.568924
H  1.076297 0.681742 0.936196
H  1.308427 2.326443 0.378071
H  1.679829 1.541923 -1.950035
H  1.427159 -0.128607 -1.464199
H  3.345101 -1.643167 -1.051008
H  4.822455 -1.172134 -0.23708
H  2.04982 -1.296508 1.073323
H  3.378222 -2.413546 1.330268
H  3.521743 -0.744311 1.882377
H  -3.438312 0.387011 2.516627
H  -2.198694 1.618858 2.178046
H  -2.022246 0.543911 3.574119
H  -3.252825 0.584799 -2.147551
H  -4.586672 -0.423443 -1.553152
H  -3.056835 -1.180228 -2.036629
elementType: S P O C H
totalener: -1924.22666023 hartree
nucrepener: 1267.29001504 hartree
electener: -3191.51667526 hartree
oneelecener: -5174.06422562 hartree
twoeener: 1982.54755036 hartree
cpcmener: -0.01892016 hartree
kineticenergy: 1919.61787065 hartree
xcener: -112.322347307728 hartree
chargesum: 0.0000000
charge: -0.192604 -0.187814 -0.448212 0.675340 -0.347990 -0.353898 -0.095476 -0.126222 -0.098319 -0.242813 -0.109372 -0.107296 0.121284 0.132730 0.123696 0.102700 0.093238 0.107532 0.053615 0.099462 0.084553 0.122041 0.111013 0.128907 0.117964 0.129476 0.106465
qa: -0.1926 -0.1878 -0.4482 0.6753 -0.3480 -0.3539 -0.0955 -0.1262 -0.0983 -0.2428 -0.1094 -0.1073 0.1213 0.1327 0.1237 0.1027 0.0932 0.1075 0.0536 0.0995 0.0846 0.1220 0.1110 0.1289 0.1180 0.1295 0.1065
va: 2.2657 2.1648 2.0097 5.3937 2.0849 2.0796 3.8672 3.9277 3.9601 3.8850 3.8409 3.8526 1.0198 1.0143 1.0130 1.0377 1.0108 1.0011 1.0302 1.0063 1.0158 0.9919 1.0017 0.9885 0.9891 0.9900 1.0032
dispcorr: -0.012063384 hartree
energy: -1924.238723611162
dipole: 5.34577 -6.43937 -1.09360 -0.58230 1.60502 1.02271 3.38962 -3.00578 0.38384
magnitude: 1.54572 au
magnitude: 3.92890 debye
