program: Orca
programVersion: 5.0.2
elementType: S S S P O O C C C C C C H H H H H H H H H H H H H H H
charge: 0
multiplicity: 1
keywords: wb97x-d3
keywords: def2-TZVPP
keywords: def2/J RIJCOSX
keywords: DEFGRID2
keywords: scfconv7
keywords: smallprint printgap noloewdin
keywords: NOSOSCF
formula: C6H15O2PS3
InChI: InChI=1/C6H15O2PS3/c1-4-11-5-6-12-9(10,7-2)8-3/h4-6H2,1-3H3
27 atoms
S  0.268116 1.147374 0.689449
S  2.070174 -0.334204 -1.840567
S  -1.465234 -1.579922 1.846166
P  -1.435182 -0.046759 0.681574
O  -2.477235 1.134919 0.987793
O  -1.720642 -0.509736 -0.829556
C  1.555537 -0.119197 0.92475
C  1.750547 -1.083121 -0.227673
C  3.560272 0.644994 -1.501016
C  4.748147 -0.17358 -1.037038
C  -3.876231 0.834164 1.092743
C  -1.714402 0.430633 -1.912336
H  1.330027 -0.673376 1.836898
H  2.4617 0.456125 1.117895
H  0.868066 -1.710163 -0.363241
H  2.563851 -1.760098 0.040472
H  3.783902 1.13817 -2.448079
H  3.325877 1.437997 -0.789411
H  5.621625 0.469324 -0.920168
H  4.564938 -0.64861 -0.073018
H  4.996511 -0.953043 -1.756366
H  -4.057957 0.096585 1.874285
H  -4.276737 0.467603 0.147839
H  -4.374291 1.762922 1.355464
H  -2.166006 -0.072939 -2.76207
H  -0.694032 0.716921 -2.162922
H  -2.297361 1.322057 -1.684051
elementType: S P O C H
totalener: -1924.22764195 hartree
nucrepener: 1285.89020035 hartree
electener: -3210.11784230 hartree
oneelecener: -5211.42397792 hartree
twoeener: 2001.30613562 hartree
cpcmener: -0.02206745 hartree
kineticenergy: 1919.64054236 hartree
xcener: -112.329432356935 hartree
chargesum: -0.0000000
charge: -0.157393 -0.164144 -0.452401 0.643489 -0.355909 -0.341877 -0.136221 -0.148147 -0.100536 -0.258071 -0.123239 -0.113651 0.136681 0.139032 0.109499 0.126525 0.114419 0.089815 0.097149 0.085387 0.081170 0.112742 0.126290 0.130898 0.131921 0.099040 0.127530
qa: -0.1574 -0.1641 -0.4524 0.6435 -0.3559 -0.3419 -0.1362 -0.1481 -0.1005 -0.2581 -0.1232 -0.1137 0.1367 0.1390 0.1095 0.1265 0.1144 0.0898 0.0971 0.0854 0.0812 0.1127 0.1263 0.1309 0.1319 0.0990 0.1275
va: 2.2868 2.1958 2.0195 5.4007 2.0764 2.0304 3.8756 3.9444 3.9480 3.9242 3.8521 3.8149 1.0244 0.9934 1.0265 1.0009 1.0001 1.0087 1.0042 0.9992 1.0134 1.0016 0.9850 0.9886 0.9909 1.0271 0.9904
dispcorr: -0.012429370 hartree
energy: -1924.240071319495
dipole: 12.09974 -11.55280 0.54693 2.39814 -1.17294 1.22520 -7.19652 6.45273 -0.74379
magnitude: 1.53410 au
magnitude: 3.89938 debye
