program: Orca
programVersion: 5.0.2
elementType: S S S P O O C C C C C C H H H H H H H H H H H H H H H
charge: 0
multiplicity: 1
keywords: wb97x-d3
keywords: def2-TZVPP
keywords: def2/J RIJCOSX
keywords: DEFGRID2
keywords: scfconv7
keywords: smallprint printgap noloewdin
keywords: NOSOSCF
formula: C6H15O2PS3
InChI: InChI=1/C6H15O2PS3/c1-4-11-5-6-12-9(10,7-2)8-3/h4-6H2,1-3H3
27 atoms
S  -0.086014 0.71366 -1.146649
S  2.618345 0.592727 0.960602
S  -1.849907 -1.999186 -0.067115
P  -1.579709 -0.093561 0.044293
O  -1.229933 0.480775 1.497025
O  -2.832012 0.831015 -0.348159
C  1.151034 -0.621607 -1.120023
C  1.827237 -0.852546 0.216127
C  3.881651 1.003458 -0.277065
C  4.941911 -0.063182 -0.463943
C  -1.965543 0.045719 2.648187
C  -3.600436 0.554982 -1.522485
H  1.871382 -0.338133 -1.888231
H  0.671252 -1.541854 -1.456049
H  2.554122 -1.657494 0.090839
H  1.107512 -1.207825 0.955289
H  3.399585 1.25008 -1.224461
H  4.331922 1.927922 0.088409
H  5.690266 0.27558 -1.18251
H  5.45044 -0.283423 0.47434
H  4.522337 -0.993277 -0.84798
H  -1.947716 -1.040132 2.7395
H  -2.998847 0.390623 2.607957
H  -1.475146 0.484865 3.513014
H  -3.017661 0.741524 -2.42555
H  -4.45488 1.226747 -1.504152
H  -3.955226 -0.475953 -1.529427
elementType: S P O C H
totalener: -1924.22764707 hartree
nucrepener: 1275.25486488 hartree
electener: -3199.48251194 hartree
oneelecener: -5190.48228876 hartree
twoeener: 1990.99977682 hartree
cpcmener: -0.02119448 hartree
kineticenergy: 1919.63576504 hartree
xcener: -112.328244879127 hartree
chargesum: 0.0000000
charge: -0.151665 -0.174647 -0.465531 0.663085 -0.346228 -0.363021 -0.128428 -0.143277 -0.106762 -0.256309 -0.110966 -0.105756 0.137735 0.136317 0.128188 0.105095 0.092310 0.112386 0.095499 0.080016 0.087346 0.107333 0.127303 0.128788 0.111577 0.130254 0.109360
qa: -0.1517 -0.1746 -0.4655 0.6631 -0.3462 -0.3630 -0.1284 -0.1433 -0.1068 -0.2563 -0.1110 -0.1058 0.1377 0.1363 0.1282 0.1051 0.0923 0.1124 0.0955 0.0800 0.0873 0.1073 0.1273 0.1288 0.1116 0.1303 0.1094
va: 2.3140 2.1739 1.9893 5.3928 2.0679 2.0817 3.8639 3.9493 3.9558 3.9240 3.8380 3.8476 0.9947 1.0267 1.0041 1.0228 1.0079 0.9999 1.0050 1.0133 0.9987 1.0037 0.9900 0.9894 0.9936 0.9906 1.0034
dispcorr: -0.011425716 hartree
energy: -1924.239072781462
dipole: 12.63671 -12.29092 0.34579 -0.79757 0.88219 0.08462 -1.70836 0.92330 -0.78506
magnitude: 0.86201 au
magnitude: 2.19105 debye
