program: Orca
programVersion: 5.0.2
elementType: S S S P O O C C C C C C H H H H H H H H H H H H H H H
charge: 0
multiplicity: 1
keywords: wb97x-d3
keywords: def2-TZVPP
keywords: def2/J RIJCOSX
keywords: DEFGRID2
keywords: scfconv7
keywords: smallprint printgap noloewdin
keywords: NOSOSCF
formula: C6H15O2PS3
InChI: InChI=1/C6H15O2PS3/c1-4-11-5-6-12-9(10,7-2)8-3/h4-6H2,1-3H3
27 atoms
S  -0.539292 1.331443 -0.727193
S  2.67866 1.171281 0.255079
S  -1.139875 -2.018481 -1.159338
P  -1.61449 -0.400801 -0.236125
O  -1.556018 -0.449833 1.367639
O  -3.147691 -0.016728 -0.462071
C  0.838639 0.674254 -1.728868
C  1.942749 0.015829 -0.932523
C  4.006387 0.127509 0.919842
C  3.518335 -1.024842 1.777045
C  -0.312651 -0.699537 2.030069
C  -3.748911 1.152253 0.111805
H  1.208954 1.545186 -2.271385
H  0.438042 -0.023447 -2.4631
H  2.713109 -0.312039 -1.634751
H  1.564002 -0.868836 -0.420712
H  4.620182 -0.231827 0.091668
H  4.632477 0.800816 1.507243
H  2.922686 -0.66908 2.617806
H  2.914055 -1.730415 1.20692
H  4.36998 -1.577185 2.178315
H  -0.512109 -0.658567 3.097871
H  0.429083 0.06119 1.776284
H  0.073718 -1.687225 1.776221
H  -3.241888 2.062265 -0.213067
H  -3.75526 1.104771 1.199717
H  -4.773293 1.180651 -0.249605
elementType: S P O C H
totalener: -1924.22546910 hartree
nucrepener: 1286.72765582 hartree
electener: -3210.95312493 hartree
oneelecener: -5212.93361059 hartree
twoeener: 2001.98048566 hartree
cpcmener: -0.02073870 hartree
kineticenergy: 1919.63074210 hartree
xcener: -112.328046866841 hartree
chargesum: -0.0000000
charge: -0.194049 -0.170282 -0.440163 0.647588 -0.342338 -0.354800 -0.090090 -0.130411 -0.085896 -0.271446 -0.092705 -0.117048 0.135945 0.127280 0.128791 0.071239 0.093630 0.106705 0.081485 0.089278 0.103663 0.132333 0.090130 0.113347 0.111996 0.126676 0.129142
qa: -0.1940 -0.1703 -0.4402 0.6476 -0.3423 -0.3548 -0.0901 -0.1304 -0.0859 -0.2714 -0.0927 -0.1170 0.1359 0.1273 0.1288 0.0712 0.0936 0.1067 0.0815 0.0893 0.1037 0.1323 0.0901 0.1133 0.1120 0.1267 0.1291
va: 2.2652 2.1870 2.0136 5.4098 2.0632 2.1134 3.8583 3.9951 3.9463 3.9100 3.8267 3.8557 1.0114 1.0322 1.0073 1.0214 1.0102 1.0013 1.0086 0.9970 1.0068 0.9957 1.0219 0.9972 0.9891 0.9919 0.9880
dispcorr: -0.012429307 hartree
energy: -1924.237898410663
dipole: 14.34657 -13.21143 1.13514 -0.47571 1.20311 0.72739 8.53474 -7.71936 0.81538
magnitude: 1.57559 au
magnitude: 4.00483 debye
