program: Orca
programVersion: 5.0.2
elementType: S S S P O O C C C C C C H H H H H H H H H H H H H H H
charge: 0
multiplicity: 1
keywords: wb97x-d3
keywords: def2-TZVPP
keywords: def2/J RIJCOSX
keywords: DEFGRID2
keywords: scfconv7
keywords: smallprint printgap noloewdin
keywords: NOSOSCF
formula: C6H15O2PS3
InChI: InChI=1/C6H15O2PS3/c1-4-11-5-6-12-9(10,7-2)8-3/h4-6H2,1-3H3
27 atoms
S  -0.3108 1.324321 0.457157
S  3.229003 -1.124329 -0.595052
S  -1.282992 -1.945368 0.680327
P  -1.833896 -0.11474 0.479741
O  -2.849128 0.334595 1.625634
O  -2.694577 0.236693 -0.830625
C  1.214017 0.323146 0.603078
C  1.659579 -0.22706 -0.735318
C  4.41884 0.251038 -0.563134
C  4.616994 0.920003 -1.908453
C  -3.361727 1.66865 1.740109
C  -2.147115 -0.017913 -2.126243
H  1.052907 -0.467397 1.333545
H  1.946273 1.018807 1.014336
H  1.751463 0.566065 -1.47848
H  0.929814 -0.943852 -1.113173
H  4.113493 0.973045 0.195856
H  5.353739 -0.189275 -0.213442
H  5.342099 1.731205 -1.821511
H  4.990296 0.213846 -2.649553
H  3.690922 1.351722 -2.288797
H  -2.556942 2.403662 1.790261
H  -3.921011 1.705473 2.670987
H  -4.026512 1.909075 0.911801
H  -2.926931 0.210073 -2.847842
H  -1.855955 -1.063619 -2.232653
H  -1.283045 0.619656 -2.319419
elementType: S P O C H
totalener: -1924.22733256 hartree
nucrepener: 1246.16095466 hartree
electener: -3170.38828723 hartree
oneelecener: -5131.62390121 hartree
twoeener: 1961.23561398 hartree
cpcmener: -0.02286599 hartree
kineticenergy: 1919.62476064 hartree
xcener: -112.323546407873 hartree
chargesum: -0.0000000
charge: -0.200146 -0.180334 -0.439255 0.644036 -0.351383 -0.341186 -0.077615 -0.149684 -0.097386 -0.254064 -0.116553 -0.106908 0.111767 0.139006 0.118837 0.114823 0.094779 0.106783 0.093859 0.078825 0.086728 0.111234 0.129438 0.127023 0.134483 0.111943 0.110949
qa: -0.2001 -0.1803 -0.4393 0.6440 -0.3514 -0.3412 -0.0776 -0.1497 -0.0974 -0.2541 -0.1166 -0.1069 0.1118 0.1390 0.1188 0.1148 0.0948 0.1068 0.0939 0.0788 0.0867 0.1112 0.1294 0.1270 0.1345 0.1119 0.1109
va: 2.2770 2.1698 2.0162 5.4193 2.1154 2.0578 3.8152 3.9582 3.9462 3.9180 3.8514 3.8401 1.0456 1.0066 1.0092 1.0264 1.0081 1.0013 1.0049 1.0126 1.0016 0.9933 0.9879 0.9912 0.9923 0.9990 0.9944
dispcorr: -0.011082922 hartree
energy: -1924.238415484858
dipole: 13.51691 -13.08921 0.42771 9.85665 -7.23805 2.61860 -8.91790 8.02911 -0.88878
magnitude: 2.79820 au
magnitude: 7.11246 debye
