program: Orca
programVersion: 5.0.2
elementType: S S S P O O C C C C C C H H H H H H H H H H H H H H H
charge: 0
multiplicity: 1
keywords: wb97x-d3
keywords: def2-TZVPP
keywords: def2/J RIJCOSX
keywords: DEFGRID2
keywords: scfconv7
keywords: smallprint printgap noloewdin
keywords: NOSOSCF
formula: C6H15O2PS3
InChI: InChI=1/C6H15O2PS3/c1-4-11-5-6-12-9(10,7-2)8-3/h4-6H2,1-3H3
27 atoms
S  0.250803 1.026557 0.73748
S  2.276275 0.023901 -1.850147
S  -1.588038 -1.843077 1.033232
P  -1.576184 0.037574 0.607776
O  -2.449398 1.004315 1.53641
O  -2.184218 0.412241 -0.832922
C  1.446256 -0.344529 0.821798
C  1.737028 -1.039931 -0.49181
C  3.749808 0.821646 -1.151463
C  4.858054 -0.138007 -0.769672
C  -3.86554 0.802109 1.653871
C  -1.723189 -0.244742 -2.012824
H  1.09458 -1.070876 1.555187
H  2.34506 0.114499 1.235527
H  0.845737 -1.551268 -0.859612
H  2.481109 -1.816238 -0.300942
H  4.086932 1.500283 -1.936763
H  3.464655 1.448942 -0.305321
H  5.725446 0.418239 -0.410363
H  4.554155 -0.815623 0.0286
H  5.172571 -0.739634 -1.622161
H  -4.382423 1.133569 0.754239
H  -4.196298 1.40009 2.498602
H  -4.102138 -0.245165 1.845247
H  -2.344139 0.106667 -2.832933
H  -1.820211 -1.327619 -1.929622
H  -0.683039 0.013941 -2.221829
elementType: S P O C H
totalener: -1924.22653555 hartree
nucrepener: 1275.35228453 hartree
electener: -3199.57882008 hartree
oneelecener: -5190.31223285 hartree
twoeener: 1990.73341277 hartree
cpcmener: -0.01983391 hartree
kineticenergy: 1919.62920639 hartree
xcener: -112.328100709084 hartree
chargesum: 0.0000000
charge: -0.158678 -0.171290 -0.457546 0.650784 -0.357732 -0.341169 -0.112483 -0.166506 -0.097531 -0.258786 -0.110270 -0.104654 0.133571 0.139796 0.112769 0.129324 0.114218 0.089040 0.097183 0.085973 0.081109 0.123564 0.128372 0.104076 0.134246 0.113370 0.099251
qa: -0.1587 -0.1713 -0.4575 0.6508 -0.3577 -0.3412 -0.1125 -0.1665 -0.0975 -0.2588 -0.1103 -0.1047 0.1336 0.1398 0.1128 0.1293 0.1142 0.0890 0.0972 0.0860 0.0811 0.1236 0.1284 0.1041 0.1342 0.1134 0.0993
va: 2.3023 2.1799 2.0001 5.3968 2.1066 2.0597 3.8388 3.9825 3.9478 3.9257 3.8498 3.8352 1.0309 0.9957 1.0135 1.0056 0.9999 1.0081 1.0044 0.9992 1.0130 0.9920 0.9887 1.0020 0.9930 1.0040 1.0055
dispcorr: -0.012038128 hartree
energy: -1924.238573676716
dipole: 13.11795 -12.43492 0.68304 -1.07849 1.31649 0.23799 -4.73139 4.58239 -0.14900
magnitude: 0.73850 au
magnitude: 1.87712 debye
