program: Orca
programVersion: 5.0.2
elementType: S S S P O O C C C C C C H H H H H H H H H H H H H H H
charge: 0
multiplicity: 1
keywords: wb97x-d3
keywords: def2-TZVPP
keywords: def2/J RIJCOSX
keywords: DEFGRID2
keywords: scfconv7
keywords: smallprint printgap noloewdin
keywords: NOSOSCF
formula: C6H15O2PS3
InChI: InChI=1/C6H15O2PS3/c1-4-11-5-6-12-9(10,7-2)8-3/h4-6H2,1-3H3
27 atoms
S  -0.244988 1.505701 -0.663939
S  2.292693 -0.76207 0.075112
S  -1.454828 -1.66342 -1.171481
P  -1.334859 -0.141816 0.004414
O  -0.804219 -0.391046 1.49106
O  -2.734023 0.571765 0.357384
C  0.960987 0.795572 -1.829374
C  2.319492 0.500092 -1.227012
C  2.505798 0.243033 1.574968
C  3.922792 0.74093 1.777259
C  -0.928631 -1.671004 2.11517
C  -3.654728 0.911519 -0.677673
H  1.064589 1.542711 -2.618794
H  0.517233 -0.092699 -2.280962
H  2.784173 1.408115 -0.84064
H  2.965898 0.138116 -2.029641
H  1.791935 1.066589 1.554761
H  2.211479 -0.410782 2.398093
H  4.628392 -0.087141 1.845396
H  4.245429 1.390019 0.961931
H  3.992248 1.319193 2.701168
H  -0.503014 -1.570073 3.110809
H  -0.378665 -2.433997 1.565687
H  -1.972476 -1.973874 2.20693
H  -4.544961 1.30368 -0.191465
H  -3.927609 0.036748 -1.269634
H  -3.246087 1.677264 -1.339657
elementType: S P O C H
totalener: -1924.23363556 hartree
nucrepener: 1309.80737148 hartree
electener: -3234.04100705 hartree
oneelecener: -5259.74563757 hartree
twoeener: 2025.70463052 hartree
cpcmener: -0.01626057 hartree
kineticenergy: 1919.63270075 hartree
xcener: -112.327460445611 hartree
chargesum: 0.0000000
charge: -0.171624 -0.180962 -0.456986 0.673456 -0.338839 -0.355277 -0.096864 -0.117833 -0.080549 -0.255427 -0.125975 -0.112033 0.126105 0.115182 0.103565 0.115949 0.085303 0.101897 0.080393 0.082021 0.092076 0.129121 0.110481 0.133796 0.127113 0.108625 0.107287
qa: -0.1716 -0.1810 -0.4570 0.6735 -0.3388 -0.3553 -0.0969 -0.1178 -0.0805 -0.2554 -0.1260 -0.1120 0.1261 0.1152 0.1036 0.1159 0.0853 0.1019 0.0804 0.0820 0.0921 0.1291 0.1105 0.1338 0.1271 0.1086 0.1073
va: 2.2978 2.1558 1.9920 5.3809 2.0768 2.0843 3.8870 3.9575 3.9020 3.9526 3.8329 3.8617 1.0074 1.0418 1.0141 1.0112 1.0286 1.0049 1.0115 1.0051 1.0044 0.9886 1.0022 0.9941 0.9911 1.0019 0.9963
dispcorr: -0.012286690 hartree
energy: -1924.245922254096
dipole: 10.56538 -10.17840 0.38698 3.76524 -2.65305 1.11219 5.49596 -5.26653 0.22943
magnitude: 1.19973 au
magnitude: 3.04948 debye
