program: Orca
programVersion: 5.0.2
elementType: S S S P O O C C C C C C H H H H H H H H H H H H H H H
charge: 0
multiplicity: 1
keywords: wb97x-d3
keywords: def2-TZVPP
keywords: def2/J RIJCOSX
keywords: DEFGRID2
keywords: scfconv7
keywords: smallprint printgap noloewdin
keywords: NOSOSCF
formula: C6H15O2PS3
InChI: InChI=1/C6H15O2PS3/c1-4-11-5-6-12-9(10,7-2)8-3/h4-6H2,1-3H3
27 atoms
S  -0.890442 1.427884 -0.75658
S  3.390722 0.660262 0.157178
S  -0.7485 -1.93823 -0.238859
P  -1.631947 -0.28586 0.189256
O  -1.640907 -0.018385 1.763125
O  -3.192997 -0.162176 -0.15633
C  0.88148 1.011532 -0.92911
C  1.640695 1.0780 0.380818
C  3.28976 -1.155107 0.079577
C  4.657822 -1.731162 -0.234986
C  -2.301987 1.105895 2.352443
C  -3.678345 -0.430535 -1.474188
H  1.265373 1.748918 -1.635379
H  0.950957 0.030773 -1.399865
H  1.212789 0.410606 1.130657
H  1.605071 2.088178 0.790599
H  2.923798 -1.531859 1.036309
H  2.572101 -1.449363 -0.687504
H  5.397411 -1.454729 0.517898
H  4.603642 -2.820387 -0.260127
H  5.02151 -1.394851 -1.206651
H  -1.942745 1.176145 3.376269
H  -3.382082 0.962507 2.361931
H  -2.062097 2.035539 1.83326
H  -3.387231 0.358387 -2.169387
H  -4.763436 -0.465442 -1.409971
H  -3.31219 -1.389428 -1.844313
elementType: S P O C H
totalener: -1924.23852480 hartree
nucrepener: 1258.86517833 hartree
electener: -3183.10370313 hartree
oneelecener: -5157.12696507 hartree
twoeener: 1974.02326195 hartree
cpcmener: -0.01612310 hartree
kineticenergy: 1919.60399626 hartree
xcener: -112.320170433555 hartree
chargesum: -0.0000000
charge: -0.190685 -0.172090 -0.437905 0.648996 -0.336225 -0.344749 -0.092455 -0.116751 -0.106906 -0.255846 -0.114115 -0.107150 0.129708 0.115806 0.096294 0.124698 0.094724 0.087532 0.088055 0.094116 0.086654 0.127429 0.124115 0.108349 0.112608 0.127937 0.107856
qa: -0.1907 -0.1721 -0.4379 0.6490 -0.3362 -0.3447 -0.0925 -0.1168 -0.1069 -0.2558 -0.1141 -0.1071 0.1297 0.1158 0.0963 0.1247 0.0947 0.0875 0.0881 0.0941 0.0867 0.1274 0.1241 0.1083 0.1126 0.1279 0.1079
va: 2.2821 2.1908 2.0303 5.4136 2.0886 2.0823 3.8456 3.9396 3.9957 3.9320 3.8488 3.8569 1.0143 1.0349 1.0338 1.0127 1.0021 1.0005 1.0066 1.0021 1.0081 0.9885 0.9927 1.0008 0.9933 0.9910 1.0007
dispcorr: -0.011335444 hartree
energy: -1924.249860241424
dipole: 8.21273 -9.30189 -1.08917 -0.80364 1.83109 1.02745 -0.09919 -0.05813 -0.15732
magnitude: 1.50555 au
magnitude: 3.82681 debye
