program: Orca
programVersion: 5.0.2
elementType: S S S P O O C C C C C C H H H H H H H H H H H H H H H
charge: 0
multiplicity: 1
keywords: wb97x-d3
keywords: def2-TZVPP
keywords: def2/J RIJCOSX
keywords: DEFGRID2
keywords: scfconv7
keywords: smallprint printgap noloewdin
keywords: NOSOSCF
formula: C6H15O2PS3
InChI: InChI=1/C6H15O2PS3/c1-4-11-5-6-12-9(10,7-2)8-3/h4-6H2,1-3H3
27 atoms
S  -0.626527 1.617158 -0.474671
S  3.667807 0.603352 0.041074
S  -0.571144 -1.582709 0.76427
P  -1.631662 -0.099018 0.135801
O  -2.703694 0.489565 1.176142
O  -2.571297 -0.387021 -1.125774
C  1.059138 0.989174 -0.828181
C  1.959632 1.107149 0.383086
C  3.504175 -1.207777 -0.091618
C  3.450818 -1.723301 -1.516833
C  -2.322986 0.771935 2.523688
C  -3.477096 -1.497929 -1.119954
H  1.424162 1.604126 -1.65072
H  0.981834 -0.035282 -1.187547
H  1.567424 0.525033 1.217708
H  2.019927 2.146866 0.709681
H  4.364511 -1.632284 0.42804
H  2.619321 -1.507764 0.472796
H  3.391583 -2.813876 -1.520025
H  2.584412 -1.342251 -2.056776
H  4.343037 -1.439286 -2.075295
H  -3.216804 1.118019 3.037487
H  -1.563138 1.555051 2.564047
H  -1.944803 -0.120776 3.023432
H  -2.952315 -2.434998 -0.930844
H  -3.927827 -1.535489 -2.108526
H  -4.262212 -1.364734 -0.375088
elementType: S P O C H
totalener: -1924.23587000 hartree
nucrepener: 1259.56615722 hartree
electener: -3183.80202722 hartree
oneelecener: -5158.51829061 hartree
twoeener: 1974.71626339 hartree
cpcmener: -0.01483470 hartree
kineticenergy: 1919.61560462 hartree
xcener: -112.319303955836 hartree
chargesum: 0.0000000
charge: -0.170750 -0.183006 -0.459877 0.669558 -0.346219 -0.341744 -0.067476 -0.143383 -0.088747 -0.259133 -0.105813 -0.120610 0.129152 0.100601 0.102061 0.118736 0.108731 0.087903 0.093288 0.081392 0.087155 0.129097 0.107638 0.111769 0.106853 0.128613 0.124210
qa: -0.1708 -0.1830 -0.4599 0.6696 -0.3462 -0.3417 -0.0675 -0.1434 -0.0887 -0.2591 -0.1058 -0.1206 0.1292 0.1006 0.1021 0.1187 0.1087 0.0879 0.0933 0.0814 0.0872 0.1291 0.1076 0.1118 0.1069 0.1286 0.1242
va: 2.2941 2.1624 1.9902 5.3789 2.0778 2.1064 3.7954 4.0012 3.8959 3.9446 3.8508 3.8600 1.0205 1.0474 1.0306 1.0114 1.0057 1.0224 1.0050 1.0032 1.0074 0.9915 0.9940 1.0019 1.0002 0.9884 0.9892
dispcorr: -0.011568821 hartree
energy: -1924.247438818721
dipole: 6.40920 -7.32121 -0.91201 -6.38009 6.21178 -0.16832 -0.94557 1.15072 0.20515
magnitude: 0.94983 au
magnitude: 2.41428 debye
