program: Orca
programVersion: 5.0.2
elementType: S S S P O O C C C C C C H H H H H H H H H H H H H H H
charge: 0
multiplicity: 1
keywords: wb97x-d3
keywords: def2-TZVPP
keywords: def2/J RIJCOSX
keywords: DEFGRID2
keywords: scfconv7
keywords: smallprint printgap noloewdin
keywords: NOSOSCF
formula: C6H15O2PS3
InChI: InChI=1/C6H15O2PS3/c1-4-11-5-6-12-9(10,7-2)8-3/h4-6H2,1-3H3
27 atoms
S  -0.424724 1.877185 -0.184861
S  2.003753 -0.121035 -1.692168
S  -0.01308 -1.008659 1.6507
P  -1.185623 0.100284 0.595833
O  -2.443544 0.72852 1.367658
O  -1.953569 -0.634795 -0.603556
C  1.353128 1.834876 0.209579
C  2.217765 1.532772 -0.998825
C  2.986084 -1.101862 -0.520249
C  2.761893 -2.578869 -0.776949
C  -3.40208 -0.134972 1.987858
C  -1.367659 -1.623236 -1.44741
H  1.518166 1.128108 1.023357
H  1.589742 2.82963 0.591503
H  3.266414 1.674652 -0.723986
H  2.009914 2.241188 -1.802063
H  4.040646 -0.84517 -0.636058
H  2.684356 -0.851612 0.497244
H  1.721738 -2.856184 -0.604831
H  3.025576 -2.860231 -1.797291
H  3.380401 -3.171806 -0.101866
H  -4.001559 -0.661247 1.244772
H  -4.053221 0.498302 2.585694
H  -2.918207 -0.861825 2.642736
H  -0.868601 -1.153655 -2.293138
H  -2.180268 -2.251135 -1.807789
H  -0.65163 -2.243307 -0.907037
elementType: S P O C H
totalener: -1924.23340332 hartree
nucrepener: 1308.12169196 hartree
electener: -3232.35509529 hartree
oneelecener: -5256.28097272 hartree
twoeener: 2023.92587744 hartree
cpcmener: -0.01498023 hartree
kineticenergy: 1919.63875779 hartree
xcener: -112.330310977056 hartree
chargesum: 0.0000000
charge: -0.166458 -0.158478 -0.454378 0.666705 -0.348514 -0.340526 -0.104660 -0.114369 -0.129890 -0.257397 -0.117089 -0.093673 0.112078 0.130655 0.109064 0.113285 0.104714 0.095734 0.080692 0.092024 0.096381 0.120199 0.125569 0.103885 0.111715 0.128934 0.093796
qa: -0.1665 -0.1585 -0.4544 0.6667 -0.3485 -0.3405 -0.1047 -0.1144 -0.1299 -0.2574 -0.1171 -0.0937 0.1121 0.1307 0.1091 0.1133 0.1047 0.0957 0.0807 0.0920 0.0964 0.1202 0.1256 0.1039 0.1117 0.1289 0.0938
va: 2.2893 2.1957 2.0011 5.3962 2.1054 2.0762 3.8496 3.9654 3.9848 3.9221 3.8646 3.8601 1.0405 1.0106 1.0107 1.0093 1.0058 1.0017 1.0104 1.0054 1.0028 0.9926 0.9891 1.0004 0.9923 0.9910 1.0002
dispcorr: -0.012675200 hartree
energy: -1924.246078522409
dipole: 8.64195 -8.23959 0.40236 -8.60676 8.53980 -0.06696 -2.62061 2.48583 -0.13478
magnitude: 0.42958 au
magnitude: 1.09191 debye
