program: Orca
programVersion: 5.0.2
elementType: S S S P O O C C C C C C H H H H H H H H H H H H H H H
charge: 0
multiplicity: 1
keywords: wb97x-d3
keywords: def2-TZVPP
keywords: def2/J RIJCOSX
keywords: DEFGRID2
keywords: scfconv7
keywords: smallprint printgap noloewdin
keywords: NOSOSCF
formula: C6H15O2PS3
InChI: InChI=1/C6H15O2PS3/c1-4-11-5-6-12-9(10,7-2)8-3/h4-6H2,1-3H3
27 atoms
S  -0.236573 1.396163 -0.376801
S  3.167076 0.414139 -1.021993
S  -1.100872 -0.336892 2.430552
P  -1.364858 -0.11034 0.540458
O  -2.839209 0.265906 0.03476
O  -1.11127 -1.472189 -0.25275
C  1.223957 1.473155 0.712812
C  2.236198 0.361152 0.532527
C  2.227197 -0.670212 -2.137195
C  2.219456 -2.131072 -1.736263
C  -3.548935 1.371966 0.595607
C  -1.426271 -1.634502 -1.639413
H  0.869211 1.500901 1.744223
H  1.672982 2.443335 0.496857
H  1.784627 -0.622171 0.67044
H  2.980404 0.464095 1.325697
H  1.216891 -0.281305 -2.254613
H  2.72252 -0.547921 -3.102911
H  3.233133 -2.522885 -1.650153
H  1.712534 -2.295353 -0.785159
H  1.694665 -2.721479 -2.490062
H  -3.596375 1.300241 1.682876
H  -4.557705 1.335011 0.192181
H  -3.086461 2.319759 0.317229
H  -1.004365 -0.835512 -2.250808
H  -2.50409 -1.674625 -1.793135
H  -0.991394 -2.581409 -1.948602
elementType: S P O C H
totalener: -1924.23569387 hartree
nucrepener: 1297.79390470 hartree
electener: -3222.02959858 hartree
oneelecener: -5234.77824937 hartree
twoeener: 2012.74865080 hartree
cpcmener: -0.01709474 hartree
kineticenergy: 1919.62442707 hartree
xcener: -112.326008602323 hartree
chargesum: -0.0000000
charge: -0.182195 -0.180727 -0.440258 0.652336 -0.343709 -0.335312 -0.104743 -0.117855 -0.104252 -0.274768 -0.109179 -0.142343 0.126827 0.122401 0.091803 0.128346 0.085177 0.114503 0.093444 0.087400 0.096360 0.108387 0.127365 0.113056 0.119968 0.138266 0.129701
qa: -0.1822 -0.1807 -0.4403 0.6523 -0.3437 -0.3353 -0.1047 -0.1179 -0.1043 -0.2748 -0.1092 -0.1423 0.1268 0.1224 0.0918 0.1283 0.0852 0.1145 0.0934 0.0874 0.0964 0.1084 0.1274 0.1131 0.1200 0.1383 0.1297
va: 2.2827 2.1527 2.0265 5.4032 2.0829 2.0837 3.8698 3.9267 3.9328 3.9035 3.8587 3.8532 1.0348 1.0140 1.0243 1.0055 1.0220 1.0014 1.0170 1.0027 1.0027 1.0004 0.9907 0.9944 0.9836 0.9983 0.9850
dispcorr: -0.013323271 hartree
energy: -1924.249017145831
dipole: 3.62512 -4.40232 -0.77721 -4.65557 4.97454 0.31897 -9.34319 7.98641 -1.35678
magnitude: 1.59582 au
magnitude: 4.05625 debye
