program: Orca
programVersion: 5.0.2
elementType: S S S P O O C C C C C C H H H H H H H H H H H H H H H
charge: 0
multiplicity: 1
keywords: wb97x-d3
keywords: def2-TZVPP
keywords: def2/J RIJCOSX
keywords: DEFGRID2
keywords: scfconv7
keywords: smallprint printgap noloewdin
keywords: NOSOSCF
formula: C6H15O2PS3
InChI: InChI=1/C6H15O2PS3/c1-4-11-5-6-12-9(10,7-2)8-3/h4-6H2,1-3H3
27 atoms
S  -0.749175 1.629569 -0.471528
S  3.545077 0.571684 -0.943311
S  -0.695412 -1.781557 -0.006005
P  -1.580727 -0.098788 0.320899
O  -1.773692 0.291494 1.860187
O  -3.083911 0.022608 -0.225624
C  1.036802 1.396192 -0.114473
C  1.757519 0.687421 -1.24415
C  3.706844 -1.053796 -0.14684
C  3.1331 -1.154921 1.252528
C  -2.150075 -0.69819 2.826113
C  -3.43801 -0.446642 -1.528469
H  1.147207 0.884722 0.839814
H  1.422235 2.407337 0.017698
H  1.632098 1.244962 -2.173556
H  1.355539 -0.31278 -1.408621
H  3.272103 -1.810013 -0.803289
H  4.783064 -1.237587 -0.128531
H  3.533536 -0.379444 1.905821
H  2.045632 -1.079727 1.251741
H  3.387585 -2.124523 1.686922
H  -2.160915 -0.196586 3.790764
H  -1.428969 -1.515174 2.854361
H  -3.143529 -1.097347 2.618864
H  -2.97231 0.158675 -2.307924
H  -4.5187 -0.358697 -1.609647
H  -3.152205 -1.490089 -1.665735
elementType: S P O C H
totalener: -1924.23597920 hartree
nucrepener: 1265.24739763 hartree
electener: -3189.48337683 hartree
oneelecener: -5169.97148445 hartree
twoeener: 1980.48810762 hartree
cpcmener: -0.01501161 hartree
kineticenergy: 1919.61668347 hartree
xcener: -112.320658559752 hartree
chargesum: 0.0000000
charge: -0.168717 -0.179686 -0.458493 0.676385 -0.342255 -0.353311 -0.103013 -0.130805 -0.103252 -0.241493 -0.119917 -0.107527 0.119466 0.131580 0.123317 0.103348 0.093273 0.107100 0.083928 0.053916 0.099090 0.129115 0.111117 0.125964 0.112332 0.127849 0.110688
qa: -0.1687 -0.1797 -0.4585 0.6764 -0.3423 -0.3533 -0.1030 -0.1308 -0.1033 -0.2415 -0.1199 -0.1075 0.1195 0.1316 0.1233 0.1033 0.0933 0.1071 0.0839 0.0539 0.0991 0.1291 0.1111 0.1260 0.1123 0.1278 0.1107
va: 2.2895 2.1702 1.9860 5.3825 2.0861 2.0874 3.8704 3.9274 3.9668 3.8793 3.8484 3.8521 1.0222 1.0148 1.0125 1.0378 1.0102 1.0010 1.0160 1.0330 1.0067 0.9897 1.0009 0.9881 0.9914 0.9909 1.0032
dispcorr: -0.011866586 hartree
energy: -1924.247845789025
dipole: 6.45311 -7.20397 -0.75086 -6.03665 5.75637 -0.28028 3.92043 -3.52398 0.39646
magnitude: 0.89416 au
magnitude: 2.27278 debye
