program: Orca
programVersion: 5.0.2
elementType: S S S P O O C C C C C C H H H H H H H H H H H H H H H
charge: 0
multiplicity: 1
keywords: wb97x-d3
keywords: def2-TZVPP
keywords: def2/J RIJCOSX
keywords: DEFGRID2
keywords: scfconv7
keywords: smallprint printgap noloewdin
keywords: NOSOSCF
formula: C6H15O2PS3
InChI: InChI=1/C6H15O2PS3/c1-4-11-5-6-12-9(10,7-2)8-3/h4-6H2,1-3H3
27 atoms
S  -0.70507 1.676611 0.293631
S  3.196613 0.312218 -1.3281
S  -0.507239 -1.682078 0.927408
P  -1.650901 -0.157867 0.681173
O  -2.580438 0.103571 1.95049
O  -2.757431 -0.264813 -0.477713
C  1.061618 1.20751 0.191924
C  1.430102 0.688478 -1.182022
C  3.315108 -1.222964 -0.358843
C  4.670041 -1.86296 -0.594885
C  -3.551634 1.153813 2.005121
C  -2.368152 -0.470307 -1.835034
H  1.277073 0.489363 0.981514
H  1.600155 2.12815 0.41842
H  1.218535 1.442972 -1.941278
H  0.851895 -0.201728 -1.434096
H  3.177194 -1.007766 0.700759
H  2.51527 -1.895742 -0.669406
H  5.487243 -1.198814 -0.312631
H  4.761596 -2.768004 0.00674
H  4.805474 -2.141274 -1.639755
H  -3.999135 1.109294 2.994701
H  -4.331893 1.018411 1.256985
H  -3.088957 2.134219 1.877317
H  -1.738583 0.345233 -2.196158
H  -3.281336 -0.496114 -2.424685
H  -1.839363 -1.416715 -1.955255
elementType: S P O C H
totalener: -1924.23643661 hartree
nucrepener: 1256.16576188 hartree
electener: -3180.40219849 hartree
oneelecener: -5151.56798489 hartree
twoeener: 1971.16578640 hartree
cpcmener: -0.01700410 hartree
kineticenergy: 1919.61724625 hartree
xcener: -112.322429090791 hartree
chargesum: 0.0000000
charge: -0.202569 -0.172824 -0.432678 0.643327 -0.341788 -0.333391 -0.066283 -0.134010 -0.105618 -0.255192 -0.117852 -0.111139 0.113501 0.128204 0.124938 0.097171 0.091833 0.089305 0.088513 0.093729 0.087520 0.127379 0.124454 0.109421 0.107809 0.132845 0.113393
qa: -0.2026 -0.1728 -0.4327 0.6433 -0.3418 -0.3334 -0.0663 -0.1340 -0.1056 -0.2552 -0.1179 -0.1111 0.1135 0.1282 0.1249 0.0972 0.0918 0.0893 0.0885 0.0937 0.0875 0.1274 0.1245 0.1094 0.1078 0.1328 0.1134
va: 2.2729 2.1991 2.0230 5.4190 2.1234 2.0652 3.8052 3.9819 3.9912 3.9340 3.8615 3.8493 1.0390 1.0176 1.0102 1.0332 1.0010 1.0034 1.0052 1.0025 1.0095 0.9884 0.9917 0.9910 0.9937 0.9922 0.9975
dispcorr: -0.011476708 hartree
energy: -1924.247913315012
dipole: 8.86587 -9.73919 -0.87332 -1.84669 2.80695 0.96026 -5.48095 4.88372 -0.59722
magnitude: 1.42880 au
magnitude: 3.63171 debye
