program: Gaussian 09
title: 000066889
version: EM64L-G09RevD.01
frameworkgroup: C1[X(C15H17N3)]
method: RPBEPBE
basis: SDD
operation: Freq
keyword: #pfreq=noraman
keyword: PBEPBE/SDD
title: #p freq=noraman PBEPBE/SDD
converged: YES YES NO NO
title: Mulliken charges:
elementType: N N N C C C C C C C C C C C C C C C H H H H H H H H H H H H H H H H H
charge: -0.105548 -0.116705 -0.684683 0.387108 -0.022783 0.465585 -0.576977 0.375402 0.320224 -0.295211 -0.384004 0.145713 -0.477473 -0.804455 -0.391220 -0.353046 -0.813887 -0.842339 0.234219 0.270063 0.227476 0.272415 0.238446 0.238371 0.209719 0.217027 0.246672 0.224736 0.224429 0.235162 0.224904 0.224400 0.247929 0.328555 0.309776
chargesum: 0.00000
title: Mulliken charges with hydrogens summed into heavy atoms:
elementType: N N N C C C C C C C C C C C C C C C
charge: -0.105548 -0.116705 -0.046352 0.387108 -0.022783 0.465585 -0.342758 0.375402 0.320224 -0.025148 -0.156528 0.145713 -0.205058 -0.117919 -0.174194 -0.106374 -0.129559 -0.145105
polarizability: 4.75880530e+02 -5.90706502e+00 1.88369640e+02 -9.51108913e-01 3.48367764e-02 8.65196729e+01
1716.lowfreq: -22.2128 -6.3587 -0.0005 -0.0004 -0.0002 4.1053 5.9310 17.9446 41.2439
frequency: -21.5331 17.9369 41.2410 56.6275 87.3590 110.1465 163.8580 164.6966 176.0755 196.5877 203.1598 217.4959 221.9533 284.4737 301.3516 346.5757 371.6868 374.1276 390.0241 424.7794 448.1683 449.0394 454.4865 462.8980 518.5778 531.3938 555.5759 577.6081 595.4952 604.1226 709.5488 732.1701 735.6544 748.1778 775.7860 820.4818 841.3374 856.0764 887.5759 923.8334 928.3819 953.3316 955.2930 981.8997 982.9012 995.8907 1017.6868 1022.7289 1041.9347 1046.0766 1047.1224 1100.9645 1126.5828 1154.6227 1160.0031 1196.0500 1234.3309 1240.7083 1280.6733 1286.2856 1324.6093 1338.1948 1373.8068 1385.3576 1394.8750 1397.1422 1399.8959 1413.1671 1435.5356 1457.6250 1462.0406 1471.9297 1474.6814 1475.5748 1484.1569 1486.4547 1506.3422 1573.3634 1576.5833 1613.2605 1619.7068 1640.7801 2951.6243 2970.7204 2986.4259 3019.4273 3051.5154 3071.8152 3082.9815 3085.2933 3090.1168 3114.2736 3119.4975 3123.4222 3149.5268 3160.2348 3161.6157 3563.5126 3703.1636
redmass: 1.0317 3.4755 4.3883 4.2978 4.1407 1.0488 4.1303 4.1010 1.1237 2.8422 5.6651 3.2360 4.0968 2.7651 2.7583 4.5195 1.1519 3.5097 2.6998 1.6813 2.6789 2.2529 6.6447 3.2378 4.7897 4.7424 2.9927 4.9274 2.9911 5.6597 5.5533 5.7672 3.4144 3.3640 4.2159 1.4735 1.3922 5.4564 1.2902 3.2992 1.3899 2.9592 1.3655 1.4657 1.3602 1.7093 1.5050 1.4684 1.5405 1.5178 1.5926 2.4641 1.4508 1.4057 1.6840 2.4528 3.1106 2.6433 1.5414 1.6910 3.3262 7.7223 5.6177 2.6100 1.2244 1.2877 1.6949 2.7227 2.7878 1.0481 1.4979 1.0567 1.0454 1.2594 1.3431 1.5836 3.4300 6.8869 7.2197 6.0740 3.6744 1.3556 1.0398 1.0391 1.0359 1.0976 1.0940 1.0968 1.0998 1.1006 1.0950 1.0910 1.0897 1.0885 1.0910 1.0956 1.0939 1.0449 1.1036
irintensity: 0.5686 0.3393 2.9840 2.0994 0.4618 1.2815 0.0341 0.0595 0.7015 3.1176 0.6731 1.5002 1.9286 0.1951 1.5002 0.0714 150.0904 4.8577 73.1073 60.6858 7.5478 8.5513 32.9886 5.0625 2.0877 2.3532 1.5513 9.1181 10.4362 4.3887 0.6373 0.4574 0.8238 3.6581 0.8485 37.0716 45.9957 3.9324 2.1175 0.8034 12.6708 1.5212 0.7524 0.5828 2.5137 3.6558 4.2526 18.7808 11.0438 7.9877 24.1597 27.4597 85.3920 10.8732 3.9574 6.0695 72.2924 0.9862 2.6626 1.5106 204.9645 135.1829 3.2288 1.6288 12.4833 16.3760 7.5094 5.9061 16.4439 11.6672 3.8298 12.8339 13.5582 30.4631 7.8376 11.2180 159.5536 10.7785 0.5721 49.0329 153.1586 445.7928 56.3291 54.5216 31.7274 26.8906 25.8661 16.3154 16.3608 28.3222 8.5116 37.5401 37.3533 27.0107 5.0459 13.1715 10.8465 187.3722 24.9646
temp: 298.150 k
press: 1.00000 atm
elementType: 7 7 7 6 6 6 6 6 6 6 6 6 6 6 6 6 6 6 1 1 1 1 1 1 1 1 1 1 1 1 1 1 1 1 1
symmnumber: 1
zpe: 746720.3 jmol-1
zpe.correction: 0.284411 hartree
zpe.thermalcorrener: 0.301453 hartree
zpe.thermalcorrenthalpy: 0.302397 hartree
zpe.thermalcorrgfe: 0.238993 hartree
zpe.sumelectzpe: -744.743612 hartree
zpe.sumelectthermal: -744.726570 hartree
zpe.sumelectthermalent: -744.725626 hartree
zpe.sumelectthermalfe: -744.789030 hartree
dipole: 3.9983 0.7196 0.0762
dipole: 4.0632
quadrupole: -58.3737 -96.1057 -113.2533
quadrupole: -0.0468 -0.4370 0.0114
quadrupole: 30.8705 -6.8615 -24.0090 -0.0468 -0.4370 0.0114
hfenergy: -745.0280226 hartree
pointgroup: C01 [X(C15H17N3)]
dipole: 1.5808048 0.2373569 -0.0158589 debye
polarizability: 474.9809664|-14.3787765|188.933059|-10.9274903|-1.3750298|86.855817 unknown
InChI: InChI=1S/C15H17N3/c1-10-4-7-15(12(3)8-10)18-17-13-5-6-14(16)11(2)9-13/h4-9H,16H2,1-3H3
charge 0 multiplicity 1
35 atoms
N  -0.468298 0.277199 0.003204
N  0.238144 -0.832476 -0.000136
N  5.878353 -0.454333 -0.14383
C  -2.684854 1.267331 0.033172
C  -1.884519 0.080316 0.044968
C  -4.728988 -0.138565 0.12789
C  -4.092036 1.127139 0.073324
C  3.713136 0.701963 -0.094965
C  4.487606 -0.513289 -0.108392
C  -2.512319 -1.197078 0.094906
C  -3.911674 -1.302005 0.133793
C  1.645426 -0.649407 -0.036233
C  2.314805 0.611278 -0.059491
C  -2.046196 2.642303 -0.026589
C  3.823447 -1.774618 -0.084633
C  2.423628 -1.839073 -0.048706
C  -6.241129 -0.248091 0.204058
C  4.418253 2.046202 -0.118502
H  -4.710681 2.03377 0.061348
H  -1.872058 -2.084718 0.098319
H  -4.385211 -2.291076 0.169177
H  1.699206 1.517141 -0.048718
H  -1.364163 2.802147 0.827278
H  -1.43313 2.757904 -0.93819
H  -2.816195 3.433514 -0.017021
H  4.417117 -2.696831 -0.094736
H  1.899233 -2.800147 -0.030114
H  -6.736399 0.605989 -0.290801
H  -6.603915 -1.17749 -0.269779
H  -6.586023 -0.261866 1.257026
H  5.082286 2.180268 0.75983
H  5.039163 2.171955 -1.029062
H  3.688225 2.871715 -0.105086
H  6.367382 0.435226 -0.165208
H  6.43098 -1.307098 -0.153902
