program: Orca
programVersion: 5.0.2
elementType: S S S P O O C C C C C C H H H H H H H H H H H H H H H
charge: 0
multiplicity: 1
keywords: wb97x-d3
keywords: def2-TZVPP
keywords: def2/J RIJCOSX
keywords: DEFGRID2
keywords: scfconv7
keywords: smallprint printgap noloewdin
keywords: NOSOSCF
formula: C6H15O2PS3
InChI: InChI=1/C6H15O2PS3/c1-4-11-5-6-12-9(10,7-2)8-3/h4-6H2,1-3H3
27 atoms
S  -0.838384 1.448475 -1.036393
S  3.408563 0.652622 -0.002897
S  -0.88798 -1.827983 -0.066216
P  -1.649404 -0.0681 0.13112
O  -1.60281 0.55442 1.604558
O  -3.212229 0.076863 -0.201723
C  0.911876 0.927566 -1.145472
C  1.678801 1.176796 0.137932
C  3.2349 -1.135709 0.280603
C  4.584055 -1.810998 0.12355
C  -1.971613 -0.2431 2.737453
C  -3.760953 -0.477549 -1.398702
H  1.322298 1.522083 -1.9620
H  0.93571 -0.118625 -1.449047
H  1.226012 0.66157 0.986873
H  1.686762 2.241452 0.375007
H  2.839225 -1.297279 1.284835
H  2.5188 -1.55228 -0.428997
H  4.488538 -2.879676 0.319164
H  4.976972 -1.692779 -0.886741
H  5.320293 -1.412299 0.822532
H  -3.025503 -0.521345 2.699987
H  -1.796268 0.370084 3.618094
H  -1.361285 -1.144572 2.801097
H  -3.536621 -1.541831 -1.483188
H  -3.383614 0.040673 -2.282124
H  -4.838836 -0.343455 -1.342003
elementType: S P O C H
totalener: -1924.23870233 hartree
nucrepener: 1257.20865856 hartree
electener: -3181.44736089 hartree
oneelecener: -5153.87140157 hartree
twoeener: 1972.42404068 hartree
cpcmener: -0.01489344 hartree
kineticenergy: 1919.61539739 hartree
xcener: -112.320341475128 hartree
chargesum: -0.0000000
charge: -0.163551 -0.173707 -0.457332 0.659331 -0.342088 -0.352572 -0.105988 -0.107528 -0.109522 -0.256794 -0.118728 -0.106620 0.129910 0.117889 0.092666 0.125542 0.095646 0.087687 0.094108 0.088091 0.088518 0.127288 0.129269 0.109739 0.109995 0.110456 0.128296
qa: -0.1636 -0.1737 -0.4573 0.6593 -0.3421 -0.3526 -0.1060 -0.1075 -0.1095 -0.2568 -0.1187 -0.1066 0.1299 0.1179 0.0927 0.1255 0.0956 0.0877 0.0941 0.0881 0.0885 0.1273 0.1293 0.1097 0.1100 0.1105 0.1283
va: 2.3066 2.1887 1.9985 5.3965 2.0756 2.0898 3.8592 3.9365 3.9979 3.9310 3.8439 3.8507 1.0139 1.0345 1.0331 1.0127 1.0011 1.0008 1.0020 1.0075 1.0068 0.9896 0.9896 1.0024 1.0026 0.9935 0.9907
dispcorr: -0.011128498 hartree
energy: -1924.249830824251
dipole: 8.83437 -9.68627 -0.85190 -6.61223 6.40567 -0.20656 2.65962 -2.46887 0.19075
magnitude: 0.89710 au
magnitude: 2.28024 debye
