program: Orca
programVersion: 5.0.2
elementType: S S S P O O C C C C C C H H H H H H H H H H H H H H H
charge: 0
multiplicity: 1
keywords: wb97x-d3
keywords: def2-TZVPP
keywords: def2/J RIJCOSX
keywords: DEFGRID2
keywords: scfconv7
keywords: smallprint printgap noloewdin
keywords: NOSOSCF
formula: C6H15O2PS3
InChI: InChI=1/C6H15O2PS3/c1-4-11-5-6-12-9(10,7-2)8-3/h4-6H2,1-3H3
27 atoms
S  0.308745 -1.067397 0.673902
S  2.396594 0.45383 -1.574472
S  -2.865548 -1.7290 0.143921
P  -1.599275 -0.310111 0.440844
O  -1.792843 0.597232 1.743181
O  -1.558483 0.825971 -0.695099
C  1.343242 0.392179 1.051095
C  1.709724 1.282317 -0.120829
C  3.8233 -0.428223 -0.880132
C  4.888572 0.471045 -0.286589
C  -3.013893 1.318625 1.947361
C  -1.452964 0.463092 -2.071918
H  2.236091 -0.040625 1.504721
H  0.862292 0.983327 1.830373
H  2.408496 2.037402 0.246149
H  0.837435 1.825643 -0.48411
H  3.483275 -1.169068 -0.154857
H  4.228451 -0.992431 -1.721961
H  5.263288 1.181173 -1.023143
H  4.518187 1.035662 0.569763
H  5.731129 -0.129004 0.061905
H  -3.883216 0.675499 1.803149
H  -3.080408 2.174687 1.276789
H  -3.000692 1.670417 2.975409
H  -2.265864 -0.201196 -2.368677
H  -0.498259 -0.023383 -2.279573
H  -1.515907 1.383382 -2.646986
elementType: S P O C H
totalener: -1924.23703277 hartree
nucrepener: 1276.59494519 hartree
electener: -3200.83197795 hartree
oneelecener: -5192.58679824 hartree
twoeener: 1991.75482029 hartree
cpcmener: -0.01949255 hartree
kineticenergy: 1919.62113284 hartree
xcener: -112.326333658504 hartree
chargesum: -0.0000000
charge: -0.145688 -0.160325 -0.456024 0.634983 -0.341558 -0.337621 -0.140588 -0.170730 -0.099419 -0.257016 -0.109836 -0.112412 0.131946 0.140873 0.125557 0.128192 0.086935 0.113988 0.082376 0.084334 0.096220 0.104885 0.122897 0.125945 0.120666 0.099227 0.132194
qa: -0.1457 -0.1603 -0.4560 0.6350 -0.3416 -0.3376 -0.1406 -0.1707 -0.0994 -0.2570 -0.1098 -0.1124 0.1319 0.1409 0.1256 0.1282 0.0869 0.1140 0.0824 0.0843 0.0962 0.1049 0.1229 0.1259 0.1207 0.0992 0.1322
va: 2.3095 2.1948 2.0170 5.4216 2.0860 2.0416 3.8927 3.9807 3.9482 3.9249 3.8500 3.8138 0.9940 1.0165 1.0034 1.0088 1.0090 1.0004 1.0132 0.9999 1.0047 1.0034 0.9914 0.9892 1.0102 1.0143 0.9883
dispcorr: -0.012269540 hartree
energy: -1924.249302306861
dipole: 16.03722 -14.61860 1.41862 10.63536 -8.65307 1.98228 -0.81746 1.34132 0.52386
magnitude: 2.49326 au
magnitude: 6.33736 debye
