program: Orca
programVersion: 5.0.2
elementType: S S S P O O C C C C C C H H H H H H H H H H H H H H H
charge: 0
multiplicity: 1
keywords: wb97x-d3
keywords: def2-TZVPP
keywords: def2/J RIJCOSX
keywords: DEFGRID2
keywords: scfconv7
keywords: smallprint printgap noloewdin
keywords: NOSOSCF
formula: C6H15O2PS3
InChI: InChI=1/C6H15O2PS3/c1-4-11-5-6-12-9(10,7-2)8-3/h4-6H2,1-3H3
27 atoms
S  -0.507034 -0.810482 -1.471184
S  3.444847 1.028539 -0.584452
S  -3.544636 -0.408207 -0.322816
P  -1.687762 -0.269693 0.150797
O  -1.173762 -1.112145 1.411716
O  -1.157719 1.145463 0.681246
C  1.195649 -0.570846 -0.821833
C  1.758711 0.782711 -1.203259
C  3.148889 1.195724 1.207844
C  3.508843 -0.042209 2.006651
C  -1.376163 -2.525818 1.457526
C  -1.547191 2.341498 0.000441
H  1.790827 -1.374426 -1.255641
H  1.18309 -0.72509 0.255778
H  1.125819 1.59582 -0.847383
H  1.823194 0.875629 -2.288634
H  3.743025 2.046096 1.545778
H  2.101991 1.471561 1.351281
H  3.335747 0.133839 3.070472
H  2.914734 -0.906435 1.710107
H  4.560143 -0.302669 1.881939
H  -0.948956 -2.871157 2.395557
H  -0.870967 -3.028157 0.630786
H  -2.438179 -2.773016 1.434163
H  -0.980461 3.153075 0.449893
H  -2.613088 2.531612 0.127684
H  -1.31607 2.295983 -1.065486
elementType: S P O C H
totalener: -1924.23910463 hartree
nucrepener: 1266.31275833 hartree
electener: -3190.55186296 hartree
oneelecener: -5171.29470571 hartree
twoeener: 1980.74284275 hartree
cpcmener: -0.01913728 hartree
kineticenergy: 1919.61363933 hartree
xcener: -112.319756878406 hartree
chargesum: 0.0000000
charge: -0.175023 -0.186572 -0.442758 0.622360 -0.335666 -0.336692 -0.085056 -0.138163 -0.085529 -0.257532 -0.112832 -0.129084 0.129834 0.111552 0.109064 0.122016 0.107574 0.088214 0.092765 0.078409 0.087463 0.130191 0.112358 0.118212 0.132049 0.129153 0.113690
qa: -0.1750 -0.1866 -0.4428 0.6224 -0.3357 -0.3367 -0.0851 -0.1382 -0.0855 -0.2575 -0.1128 -0.1291 0.1298 0.1116 0.1091 0.1220 0.1076 0.0882 0.0928 0.0784 0.0875 0.1302 0.1124 0.1182 0.1320 0.1292 0.1137
va: 2.2924 2.1582 2.0287 5.4432 2.0829 2.0793 3.8374 4.0219 3.9049 3.9498 3.8391 3.8366 1.0178 1.0307 1.0130 1.0081 1.0041 1.0165 1.0054 1.0056 1.0058 0.9906 0.9947 1.0020 0.9877 1.0048 0.9931
dispcorr: -0.012346281 hartree
energy: -1924.251450909229
dipole: 14.88124 -13.61873 1.26251 2.11009 -2.02626 0.08383 8.61149 -7.85443 0.75706
magnitude: 1.47448 au
magnitude: 3.74783 debye
