program: Orca
programVersion: 5.0.2
elementType: S S S P O O C C C C C C H H H H H H H H H H H H H H H
charge: 0
multiplicity: 1
keywords: wb97x-d3
keywords: def2-TZVPP
keywords: def2/J RIJCOSX
keywords: DEFGRID2
keywords: scfconv7
keywords: smallprint printgap noloewdin
keywords: NOSOSCF
formula: C6H15O2PS3
InChI: InChI=1/C6H15O2PS3/c1-4-11-5-6-12-9(10,7-2)8-3/h4-6H2,1-3H3
27 atoms
S  -0.459858 1.098971 -0.105463
S  3.721231 0.079979 -1.017757
S  -1.734424 -1.914203 -1.035328
P  -1.913155 -0.38443 0.111856
O  -1.954759 -0.80389 1.651343
O  -3.252437 0.489532 -0.008687
C  1.026207 0.075256 -0.444165
C  2.212283 1.00467 -0.624656
C  4.210303 -0.525726 0.624762
C  4.832862 0.536437 1.508515
C  -2.156873 0.146599 2.703135
C  -3.731428 0.938229 -1.278559
H  0.845158 -0.503223 -1.347997
H  1.1829 -0.608717 0.388842
H  2.379886 1.622903 0.258508
H  2.045558 1.681216 -1.464727
H  3.350464 -0.992243 1.108573
H  4.925047 -1.327322 0.429799
H  5.112091 0.106354 2.472465
H  5.731624 0.95204 1.053234
H  4.144176 1.358428 1.7067
H  -1.831403 -0.331181 3.624109
H  -3.210289 0.41077 2.789663
H  -1.566373 1.05214 2.552442
H  -4.749798 1.287563 -1.125987
H  -3.738262 0.127502 -2.008368
H  -3.124472 1.760818 -1.659213
elementType: S P O C H
totalener: -1924.23703614 hartree
nucrepener: 1225.20291859 hartree
electener: -3149.43995474 hartree
oneelecener: -5089.63089496 hartree
twoeener: 1940.19094023 hartree
cpcmener: -0.01910135 hartree
kineticenergy: 1919.60905223 hartree
xcener: -112.319934522720 hartree
chargesum: 0.0000000
charge: -0.194279 -0.174055 -0.439733 0.649345 -0.335040 -0.341588 -0.095215 -0.138051 -0.099971 -0.251114 -0.110554 -0.106379 0.107532 0.123051 0.115080 0.128857 0.094555 0.105699 0.092482 0.080214 0.084994 0.126735 0.120170 0.108389 0.127491 0.106906 0.114479
qa: -0.1943 -0.1741 -0.4397 0.6493 -0.3350 -0.3416 -0.0952 -0.1381 -0.1000 -0.2511 -0.1106 -0.1064 0.1075 0.1231 0.1151 0.1289 0.0946 0.1057 0.0925 0.0802 0.0850 0.1267 0.1202 0.1084 0.1275 0.1069 0.1145
va: 2.2808 2.1628 2.0296 5.4253 2.0991 2.0783 3.8976 3.9535 3.9440 3.9195 3.8494 3.8558 1.0313 1.0101 1.0097 1.0091 1.0089 1.0026 1.0052 1.0119 1.0018 0.9891 0.9914 1.0009 0.9906 1.0022 0.9914
dispcorr: -0.010062246 hartree
energy: -1924.247098387136
dipole: 12.65261 -12.62164 0.03097 6.96106 -5.27072 1.69034 8.26020 -6.84983 1.41037
magnitude: 2.20167 au
magnitude: 5.59621 debye
