program: Orca
programVersion: 5.0.2
elementType: S S S P O O C C C C C C H H H H H H H H H H H H H H H
charge: 0
multiplicity: 1
keywords: wb97x-d3
keywords: def2-TZVPP
keywords: def2/J RIJCOSX
keywords: DEFGRID2
keywords: scfconv7
keywords: smallprint printgap noloewdin
keywords: NOSOSCF
formula: C6H15O2PS3
InChI: InChI=1/C6H15O2PS3/c1-4-11-5-6-12-9(10,7-2)8-3/h4-6H2,1-3H3
27 atoms
S  -0.769173 1.494206 -0.335099
S  3.604839 0.78681 -0.62267
S  -0.351936 -1.583559 1.099078
P  -1.570995 -0.316106 0.323474
O  -2.762752 0.220506 1.248763
O  -2.38053 -0.96174 -0.891666
C  0.863647 0.974527 -0.990382
C  1.95271 1.126352 0.053973
C  3.86151 -0.956733 -0.180773
C  3.025507 -1.953359 -0.958342
C  -2.511026 0.754347 2.551028
C  -3.423403 -0.263609 -1.581466
H  1.046319 1.633339 -1.839076
H  0.793353 -0.040615 -1.376307
H  1.774328 0.477577 0.91162
H  1.972012 2.153532 0.42124
H  4.9239 -1.128486 -0.366131
H  3.709537 -1.070647 0.894126
H  3.316035 -2.971057 -0.689634
H  1.964021 -1.853062 -0.733751
H  3.163636 -1.836438 -2.033067
H  -3.470071 0.809339 3.060564
H  -2.081352 1.75484 2.487788
H  -1.840962 0.109202 3.121435
H  -3.135545 0.760809 -1.824198
H  -4.340014 -0.252494 -0.992664
H  -3.601164 -0.804288 -2.507786
elementType: S P O C H
totalener: -1924.23608313 hartree
nucrepener: 1263.38836819 hartree
electener: -3187.62445133 hartree
oneelecener: -5166.22895459 hartree
twoeener: 1978.60450327 hartree
cpcmener: -0.01605944 hartree
kineticenergy: 1919.62397290 hartree
xcener: -112.323459598451 hartree
chargesum: -0.0000000
charge: -0.194156 -0.180495 -0.438759 0.662637 -0.342749 -0.336820 -0.091393 -0.127214 -0.100254 -0.242909 -0.107009 -0.112252 0.130315 0.116403 0.101635 0.121544 0.105243 0.093431 0.097183 0.056757 0.083572 0.127796 0.114070 0.107375 0.109402 0.119949 0.126697
qa: -0.1942 -0.1805 -0.4388 0.6626 -0.3427 -0.3368 -0.0914 -0.1272 -0.1003 -0.2429 -0.1070 -0.1123 0.1303 0.1164 0.1016 0.1215 0.1052 0.0934 0.0972 0.0568 0.0836 0.1278 0.1141 0.1074 0.1094 0.1199 0.1267
va: 2.2700 2.1690 2.0173 5.4074 2.0783 2.1078 3.8511 3.9307 3.9631 3.8767 3.8561 3.8518 1.0170 1.0272 1.0365 1.0138 1.0013 1.0102 1.0074 1.0369 1.0157 0.9909 0.9918 1.0021 1.0001 0.9911 0.9892
dispcorr: -0.011807217 hartree
energy: -1924.247890350471
dipole: 5.28754 -6.35098 -1.06344 -1.58035 2.49489 0.91454 -1.95610 1.84335 -0.11275
magnitude: 1.40713 au
magnitude: 3.57663 debye
